{"text_format":"1","workbook":"xlsx","n_sheets":9,"sheets":["Startseite","Hilfe","Eingaben","Abschreibung","Journal","VERLAUF","Tabvorlage","Tabelle1","ICONS"],"not_rendered":{"charts":0,"images":16,"macros":1,"external_links":0,"defined_names":34,"comments":1,"pivot_tables":0},"unopened":[],"bounds":{"document_bytes":16777216,"sheet_cells":100000,"rows_first":2000,"rows_last":500,"rows_between":2000,"halvings":0,"cell_chars":16384,"cell_head_chars":4096},"cells_cut":0,"cells_raw":0,"read":"whole","date_system":"1900"}

{"sheet":"Startseite","index":0,"n_rows":29,"n_cols":8,"rows_kept":29,"cut":false,"hidden":false,"merged":[[28,7,28,10],[22,2,22,4],[22,6,22,8],[23,2,23,4],[23,6,23,8],[24,2,24,4],[25,2,25,4],[25,6,25,8],[26,2,26,4],[26,6,26,8],[18,2,18,4],[18,6,18,8],[24,6,24,8],[19,2,19,4],[19,6,19,8],[20,2,20,4],[20,6,20,8],[21,2,21,4],[21,6,21,8],[16,2,16,4],[16,6,16,8],[17,2,17,4],[17,6,17,8],[14,2,14,4],[14,6,14,8],[15,2,15,4],[15,6,15,8],[12,2,12,4],[12,6,12,8],[13,2,13,4],[13,6,13,8],[0,1,3,10],[9,2,9,9],[10,6,10,8],[11,2,11,4],[11,6,11,8]]}
[null,"Abschreibungsalternativen"]
[]
[]
[]
[]
[]
[null,null,"Abschreibungsalternativen für Wirtschaftsgüter zwischen 150 Euro bis 1.000 Euro *)"]
[null,null,"Susanne Kowalski, Hamminkeln"]
[]
[null,null,"Für Wirtschaftsgüter mit einem Wert zwischen 150 EUR bis 1.000 EUR netto gibt es seit dem 1.1.2010 ein Wahlrecht bei der Abschreibung. Ab sofort dürfen Sie für diese Wirtschaftsgüter zwischen einer sogenannten Pool- und Sofortabschreibung wählen. Diese Wahl ist für das komplette Wirtschaftsjahr bindend. In der Regel ist auf den ersten Blick nicht zu beurteilen, welche Variante für ein Unternehmen die günstigere ist. Dieses Tool hilft Ihnen bei der Auswahl der richtigen Alternative.\n"]
[null,null,"» Hilfe",null,null,null,"» Abschreibung"]
[null,null,"» Eingaben",null,null,null,"» Journal"]
[]
[]
[]
[]
[]
[]
[]
[]
[]
[]
[]
[]
[]
[]
[]
[]
[null,null,null,null,null,null,null,"Tabelle einfügen / Startseite konfigurieren"]

{"sheet":"Hilfe","index":1,"n_rows":98,"n_cols":14,"rows_kept":98,"cut":false,"hidden":false,"merged":[[97,3,97,13],[53,3,53,13],[68,3,68,13],[71,11,71,14],[72,3,72,13],[76,3,76,13],[82,3,82,13],[85,3,85,13],[89,3,89,13],[93,3,93,13],[34,3,34,13],[36,3,36,13],[80,3,80,13],[38,3,38,13],[41,3,41,13],[43,4,43,13],[47,3,47,13],[51,3,51,13],[52,3,52,13],[20,3,20,13],[26,3,26,13],[27,3,27,13],[30,3,30,13],[16,3,16,13],[17,3,17,13],[18,3,18,13],[19,3,19,13],[13,3,13,13],[0,2,2,10],[14,3,14,13],[15,3,15,13],[5,3,5,4],[6,3,6,4],[11,3,11,13],[12,3,12,13]]}
[null,null,"Anwenderhilfe für Excel"]
[]
[]
[]
[]
[null,null,null,"» Inhaltliche Hilfe",null,null,null,null,null,null,null,null,null,"» Startseite"]
[null,null,null,"» Technische Hilfe"]
[]
[]
[null,null,null,"Inhaltliche Hilfe"]
[]
[]
[]
[]
[]
[]
[]
[]
[]
[]
[]
[]
[]
[]
[null,null,null,"Technische Hilfe",null,null,null,null,null,null,null,null,null,"» Startseite"]
[]
[null,null,null,"Zum komfortablen Umgang mit diesem und anderen Excel-Tools erläutern wir hier einige Funktionen, die Sie beim Arbeiten mit Excel häufig benötigen, wie etwa die Anpassung der Startseite an Ihre persönlichen Bedürfnisse oder die Möglichkeiten der Haufe Toolbar. "]
[]
[]
[null,null,null,"Startseite konfigurieren"]
[null,null,null,"Über den Link Startseite konfigurieren gelangen Sie in ein Dialogfeld, in dem Sie alle nötigen Anpassungen der Startseite vornehmen können. \nHier können Sie weitere Tabellen einfügen, diese umbenennen oder löschen. Haben Sie eine Tabelle in der Liste markiert, können Sie mithilfe der Pfeiltasten die Reihenfolge der Tabellen ändern. Diese Änderung wirkt sich sowohl auf die Darstellung auf der Startseite aus, als auch auf die Position der Tabelle im Blattregister und im Listenfeld in der Toolbar."]
[]
[]
[]
[null,null,null,"Klicken Sie auf Speichern, werden die vorgenommenen Änderungen wirksam und Sie springen zurück zur Startseite."]
[]
[null,null,null,"Wenn Sie eine Tabelle im Listenfeld ausgewählt haben, gelangen Sie über den Button Gehe zu direkt zur gewünschten Tabelle."]
[]
[null,null,null,"Möchten Sie eine Tabelle umbenennen, markieren Sie diese und vergeben Sie im nebenstehenden Feld einen neuen Namen. \nMithilfe des Buttons Tabelle umbenennen werden die Änderungen gespeichert."]
[]
[null,null,null,"Logo auswählen"]
[null,null,null,"Über das Feld Logo auswählen können Sie Ihr eigenes Firmenlogo auf jeder Tabellenseite einbinden. Klicken Sie auf Durchsuchen, wählen Sie die gewünschte Datei aus und importieren Sie diese mithilfe des Buttons Hochladen.\nBitte beachten Sie dabei unbedingt die maximale Größe des neuen Logos. Die Datei sollte die Maße 35 px (Breite) und 84px (Höhe) nicht überschreiten. Bitte achten Sie auch darauf, dass die Datei 50 KB nicht überschreitet."]
[]
[null,null,null,"Hinweis:","Bitte ändern Sie die Namen der Blattregister nur über das Dialogfeld Tabelle einfügen/Startseite konfigurieren auf der Startseite. \nWenn Sie die Blattregister per Doppelklick umbenennen, funktionieren die Navigationslinks der Startseite bis zu einer Aktualisierung nicht mehr)."]
[]
[]
[null,null,null,"Haufe Toolbar"]
[null,null,null,"Die Haufe Toolbar ist das zentrale Navigationselement und erleichtert Ihnen die Navigation innerhalb des Tools. Hier werden ebenfalls die wichtigsten Funktionen für die Handhabung des Tools angeboten."]
[]
[]
[]
[null,null,null,"Mithilfe der Vor- und Zurück-Schaltflächen können Sie innerhalb der zuletzt aufgerufenen Seiten navigieren."]
[null,null,null,"Über das Listenfeld rufen Sie direkt die gewünschten Tabellen auf."]
[null,null,null,"Die wichtigsten Funktionen Speichern, Drucken, Kopieren und Einfügen werden ebenfalls zentral in der Toolbar angeboten"]
[]
[]
[null,null,null,"Optionen"]
[]
[null,null,null,null,null,null,null,"» Gitternetz ein/aus"]
[null,null,null,null,null,null,null,"» Zeilen- und Spaltenbeschriftung ein/aus"]
[null,null,null,null,null,null,null,"» Blattregister ein/aus"]
[null,null,null,null,null,null,null,"» Kopf- und Fußzeile anpassen"]
[null,null,null,null,null,null,null,"» Zoom einstellen"]
[]
[]
[]
[]
[null,null,null,"Gitternetz ein/aus"]
[null,null,null,"Mit Hilfe dieses Menübefehls können Sie die Anzeige des Gitternetzes ein- und ausschalten."]
[]
[]
[null,null,null,"Zeilen- und Spaltenbeschriftung ein/aus"]
[null,null,null,"Mit Hilfe dieses Menübefehls können Sie die Anzeige der Zeilen- und Spaltenköpfe ein- und ausschalten. "]
[]
[]
[null,null,null,"Blattregister ein/aus"]
[null,null,null,"Mit Hilfe dieses Menübefehls können Sie die Anzeige der Blattregister ein- und ausschalten."]
[]
[]
[null,null,null,"Kopf- und Fußzeile bearbeiten"]
[null,null,null,"Über diesen Menübefehl rufen Sie einen Dialog auf, in dem Sie Ihre Kopf- und Fußzeilen einstellen können. Auf dem Reiter Eingabe Daten können Sie Angaben zur Firma, zur Abteilung und zum Autor eintragen."]
[]
[null,null,null,"Auf dem Reiter Kopf- und Fußzeile anpassen können Sie auswählen, wo die gewünschten Angaben platziert werden sollen. \nWählen Sie dazu den Bereich (Kopf- oder Fußzeile) aus, sowie die Platzierung (Links, Mitte oder Rechts)."]
[]
[]
[null,null,null,"Damit Sie Ihre Einstellungen in der Vorschau überprüfen können, müssen Sie die Einstellungen übernehmen mithilfe des gleichnamigen Buttons. Die Schaltfläche Alle Kopf- und Fußzeilen entfernen löscht alle Eintragungen in der Kopf- und Fußzeile. \nBitte beachten Sie, dass diese beiden Vorgänge etwas Zeit in Anspruch nehmen können."]
[]
[]
[null,null,null,"Zoom einstellen"]
[null,null,null,"Mit Hilfe dieses Menübefehls können Sie den Zoom für die einzelnen Arbeitsblätter einstellen. Standardmäßig ist ein 85%-iger Zoom eingestellt, den Sie jedoch jederzeit ändern können."]
[]
[]
[null,null,null,"Hilfe"]
[null,null,null,"Über den Hilfe-Button der Haufe Toolbar gelangen Sie auf die Hilfe-Seite, die Ihnen inhaltliche Hilfestellung bietet, sowie Hinweise zur technischen Handhabung des Tools."]
[]
[]
[null,null,null,"Hinweis"]
[null,null,null,"Beim mehrmaligen Öffnen mit dem IE 7 oder IE 8 aus einer Online-Version heraus, erscheint die Meldung, dass dieses Tool bereits verwendet wird. Öffnen Sie es schreibgeschützt und speichern Sie es lokal auf Ihrem Rechner ab. Wenn Sie die Meldung unterbinden möchten, aktivieren Sie über Extras > Internetoptionen > Erweitert > Bei Einstellungen/Sicherheit die Option \"Leeren des Ordners für temporäre Internetdateien beim Schließen des Browsers\"."]

{"sheet":"Eingaben","index":2,"n_rows":151,"n_cols":17,"rows_kept":151,"cut":false,"hidden":false,"merged":[[0,1,2,12]]}
[null,"Eingaben"]
[]
[]
[]
[null,"Eingaben",null,null,null,null,null,null,null,null,null,null,"» Startseite",{"$f":"F9","v":0},{"$f":"F11","v":0},{"$f":"F13","v":0},{"$f":"IF(F13=0,0,VLOOKUP(F15,B44:C56,2,FALSE))","v":0}]
[]
[]
[]
[null,null,"Bezeichnung des Wirtschaftsgutes",null,null,null,null,null,"Spitzensteuersatz"]
[]
[null,null,"Anschaffungswert des Wirtschaftsgutes"]
[]
[null,null,"Abschreibungszeitraum in Jahren",null,null,null,null,{"$f":"IF($F$11<410.01,\"Angabe des Abschreibungszeitraums nicht erforderlich\",\"\")","v":"Angabe des Abschreibungszeitraums nicht erforderlich"}]
[]
[null,null,"Anschaffungsmonat",null,null,null,null,{"$f":"IF($F$11<410.01,\"Angabe des Abschreibungsmonats nicht erforderlich\",\"\")","v":"Angabe des Abschreibungsmonats nicht erforderlich"}]
[null,null,null,null,null,{"$f":"13-Q5","v":13}]
[null,null,null,null,null,{"$f":"IF(1/F13*2.5>25%,25%,1/F13*2.5)","v":{"$error":"#DIV/0!"}}]
[]
[null,null,"Kurzüberblick"]
[]
[]
[]
[null,null,"Sofortabschreibung / linear",null,null,{"$f":"IF($F$11<410.01,$F$11,$F$11/$F$13/12*$F$16)","v":0}]
[]
[null,null,"Sofortabschreibung / degressiv",null,null,{"$f":"IF($F$11<410.01,$F$11,$F$11*F17/12*F16)","v":0}]
[]
[null,null,"Poolabschreibung",null,null,{"$f":"F11/5","v":0}]
[]
[]
[]
[]
[]
[]
[]
[]
[]
[]
[]
[]
[]
[]
[]
[]
[null,"Januar",1]
[null,"Februar",2]
[null,"März",3]
[null,"April",4]
[null,"Mai",5]
[null,"Juni",6]
[null,"Juli",7]
[null,"August",8]
[null,"September",9]
[null,"Oktober",10]
[null,"November",11]
[null,"Dezember",12]
[]
[]
[]
[]
[]
[]
[]
[]
[]
[]
[]
[]
[]
[]
[]
[]
[]
[]
[]
[]
[]
[]
[]
[]
[]
[]
[]
[]
[]
[]
[]
[]
[]
[]
[]
[]
[]
[]
[]
[]
[]
[]
[]
[]
[]
[]
[]
[]
[]
[]
[]
[]
[]
[]
[]
[]
[]
[]
[]
[]
[]
[]
[]
[]
[]
[]
[]
[]
[]
[]
[]
[]
[]
[]
[]
[]
[]
[]
[]
[]
[]
[null,"Berufserfahrung"]
[null,"Einsteiger"]
[null,"Branchenfremd"]
[null,"Stellenbezogen"]
[null,"Qualifikation"]
[null,"überqualifiziert"]
[null,"adäquat"]
[null,"durchschnittlich"]
[null,"mangelhaft"]
[]
[]
[]
[null,"Lebenslauf lückenlos"]
[null,"ja"]
[null,"nein"]

{"sheet":"Abschreibung","index":3,"n_rows":1381,"n_cols":13,"rows_kept":1381,"cut":false,"hidden":false,"merged":[[0,1,2,12]]}
[null,"Abschreibung"]
[]
[]
[]
[null,null,"Übersicht über die Abschreibung aller Wirtschaftsgüter bis zu einem Wert von 1.000 Euro",null,null,null,null,null,null,null,null,null,"» Startseite"]
[]
[]
[]
[null,null,null,"Poolabschreibung",{"$f":"SUM(J$24:J$1582)","v":0}]
[]
[null,null,null,"Sofortabschreibung / linear",{"$f":"SUM(K$24:K$1582)","v":0}]
[]
[null,null,null,"Sofortabschreibung / degressiv",{"$f":"SUM(L$24:L$1582)","v":0}]
[]
[null,null,null,"Einfluss auf Steuer / Pool",{"$f":"IF(Eingaben!$K$9=\"\",\"Keine Angabe\",E9*Eingaben!$K$9)","v":"Keine Angabe"}]
[]
[null,null,null,"Einfluss auf Steuer / Sofortabschreibung linear",{"$f":"IF(Eingaben!$K$9=\"\",\"Keine Angabe\",E11*Eingaben!$K$9)","v":"Keine Angabe"},null,"Differenz Pool / linear",null,null,null,{"$f":"IF(E15=\"Keine Angabe\",\"Keine Angabe\",+E15-E17)","v":"Keine Angabe"}]
[]
[null,null,null,"Einfluss auf Steuer / Sofortabschreibung degressiv",{"$f":"IF(Eingaben!$K$9=\"\",\"Keine Angabe\",E13*Eingaben!$K$9)","v":"Keine Angabe"},null,"Differenz Pool / degressiv",null,null,null,{"$f":"IF(E15=\"Keine Angabe\",\"Keine Angabe\",+E15-E19)","v":"Keine Angabe"}]
[]
[]
[null,null,null,null,null,null,null,null,null,null,"Abschreibung"]
[null,null,null,"Bezeichnung","Wert","Abschreibungs-\nzeitraum","Anschaffungs-\nmonat","ausblenden","ausblenden","Pool","Sofort\nlinear","Sofort\ndegressiv"]
[null,null,null,{"$f":"Journal!A5","v":0},{"$f":"Journal!B5","v":0},{"$f":"Journal!C5","v":0},{"$f":"Journal!D5","v":0},{"$f":"12-G24+1","v":13},{"$f":"IF(AND(E24=0,F24=0),0,IF(1/F24*2.5>25%,25%,1/F24*2.5))","v":0},{"$f":"E24/5","v":0},{"$f":"IF($E24<410.01,$E24,$E24/$F24/12*$H24)","v":0},{"$f":"IF($E24<410.01,$E24,$E24*I24/1/12*$H24)","v":0}]
[null,null,null,{"$f":"Journal!A6","v":0},{"$f":"Journal!B6","v":0},{"$f":"Journal!C6","v":0},{"$f":"Journal!D6","v":0},13,0,0,0,0]
[null,null,null,{"$f":"Journal!A7","v":0},{"$f":"Journal!B7","v":0},{"$f":"Journal!C7","v":0},{"$f":"Journal!D7","v":0},13,0,0,0,0]
[null,null,null,{"$f":"Journal!A8","v":0},{"$f":"Journal!B8","v":0},{"$f":"Journal!C8","v":0},{"$f":"Journal!D8","v":0},13,0,0,0,0]
[null,null,null,{"$f":"Journal!A9","v":0},{"$f":"Journal!B9","v":0},{"$f":"Journal!C9","v":0},{"$f":"Journal!D9","v":0},13,0,0,0,0]
[null,null,null,{"$f":"Journal!A10","v":0},{"$f":"Journal!B10","v":0},{"$f":"Journal!C10","v":0},{"$f":"Journal!D10","v":0},13,0,0,0,0]
[null,null,null,{"$f":"Journal!A11","v":0},{"$f":"Journal!B11","v":0},{"$f":"Journal!C11","v":0},{"$f":"Journal!D11","v":0},13,0,0,0,0]
[null,null,null,{"$f":"Journal!A12","v":0},{"$f":"Journal!B12","v":0},{"$f":"Journal!C12","v":0},{"$f":"Journal!D12","v":0},13,0,0,0,0]
[null,null,null,{"$f":"Journal!A13","v":0},{"$f":"Journal!B13","v":0},{"$f":"Journal!C13","v":0},{"$f":"Journal!D13","v":0},13,0,0,0,0]
[null,null,null,{"$f":"Journal!A14","v":0},{"$f":"Journal!B14","v":0},{"$f":"Journal!C14","v":0},{"$f":"Journal!D14","v":0},13,0,0,0,0]
[null,null,null,{"$f":"Journal!A15","v":0},{"$f":"Journal!B15","v":0},{"$f":"Journal!C15","v":0},{"$f":"Journal!D15","v":0},13,0,0,0,0]
[null,null,null,{"$f":"Journal!A16","v":0},{"$f":"Journal!B16","v":0},{"$f":"Journal!C16","v":0},{"$f":"Journal!D16","v":0},13,0,0,0,0]
[null,null,null,{"$f":"Journal!A17","v":0},{"$f":"Journal!B17","v":0},{"$f":"Journal!C17","v":0},{"$f":"Journal!D17","v":0},13,0,0,0,0]
[null,null,null,{"$f":"Journal!A18","v":0},{"$f":"Journal!B18","v":0},{"$f":"Journal!C18","v":0},{"$f":"Journal!D18","v":0},13,0,0,0,0]
[null,null,null,{"$f":"Journal!A19","v":0},{"$f":"Journal!B19","v":0},{"$f":"Journal!C19","v":0},{"$f":"Journal!D19","v":0},13,0,0,0,0]
[null,null,null,{"$f":"Journal!A20","v":0},{"$f":"Journal!B20","v":0},{"$f":"Journal!C20","v":0},{"$f":"Journal!D20","v":0},13,0,0,0,0]
[null,null,null,{"$f":"Journal!A21","v":0},{"$f":"Journal!B21","v":0},{"$f":"Journal!C21","v":0},{"$f":"Journal!D21","v":0},13,0,0,0,0]
[null,null,null,{"$f":"Journal!A22","v":0},{"$f":"Journal!B22","v":0},{"$f":"Journal!C22","v":0},{"$f":"Journal!D22","v":0},13,0,0,0,0]
[null,null,null,{"$f":"Journal!A23","v":0},{"$f":"Journal!B23","v":0},{"$f":"Journal!C23","v":0},{"$f":"Journal!D23","v":0},13,0,0,0,0]
[null,null,null,{"$f":"Journal!A24","v":0},{"$f":"Journal!B24","v":0},{"$f":"Journal!C24","v":0},{"$f":"Journal!D24","v":0},13,0,0,0,0]
[null,null,null,{"$f":"Journal!A25","v":0},{"$f":"Journal!B25","v":0},{"$f":"Journal!C25","v":0},{"$f":"Journal!D25","v":0},13,0,0,0,0]
[null,null,null,{"$f":"Journal!A26","v":0},{"$f":"Journal!B26","v":0},{"$f":"Journal!C26","v":0},{"$f":"Journal!D26","v":0},13,0,0,0,0]
[null,null,null,{"$f":"Journal!A27","v":0},{"$f":"Journal!B27","v":0},{"$f":"Journal!C27","v":0},{"$f":"Journal!D27","v":0},13,0,0,0,0]
[null,null,null,{"$f":"Journal!A28","v":0},{"$f":"Journal!B28","v":0},{"$f":"Journal!C28","v":0},{"$f":"Journal!D28","v":0},13,0,0,0,0]
[null,null,null,{"$f":"Journal!A29","v":0},{"$f":"Journal!B29","v":0},{"$f":"Journal!C29","v":0},{"$f":"Journal!D29","v":0},13,0,0,0,0]
[null,null,null,{"$f":"Journal!A30","v":0},{"$f":"Journal!B30","v":0},{"$f":"Journal!C30","v":0},{"$f":"Journal!D30","v":0},13,0,0,0,0]
[null,null,null,{"$f":"Journal!A31","v":0},{"$f":"Journal!B31","v":0},{"$f":"Journal!C31","v":0},{"$f":"Journal!D31","v":0},13,0,0,0,0]
[null,null,null,{"$f":"Journal!A32","v":0},{"$f":"Journal!B32","v":0},{"$f":"Journal!C32","v":0},{"$f":"Journal!D32","v":0},13,0,0,0,0]
[null,null,null,{"$f":"Journal!A33","v":0},{"$f":"Journal!B33","v":0},{"$f":"Journal!C33","v":0},{"$f":"Journal!D33","v":0},13,0,0,0,0]
[null,null,null,{"$f":"Journal!A34","v":0},{"$f":"Journal!B34","v":0},{"$f":"Journal!C34","v":0},{"$f":"Journal!D34","v":0},13,0,0,0,0]
[null,null,null,{"$f":"Journal!A35","v":0},{"$f":"Journal!B35","v":0},{"$f":"Journal!C35","v":0},{"$f":"Journal!D35","v":0},13,0,0,0,0]
[null,null,null,{"$f":"Journal!A36","v":0},{"$f":"Journal!B36","v":0},{"$f":"Journal!C36","v":0},{"$f":"Journal!D36","v":0},13,0,0,0,0]
[null,null,null,{"$f":"Journal!A37","v":0},{"$f":"Journal!B37","v":0},{"$f":"Journal!C37","v":0},{"$f":"Journal!D37","v":0},13,0,0,0,0]
[null,null,null,{"$f":"Journal!A38","v":0},{"$f":"Journal!B38","v":0},{"$f":"Journal!C38","v":0},{"$f":"Journal!D38","v":0},13,0,0,0,0]
[null,null,null,{"$f":"Journal!A39","v":0},{"$f":"Journal!B39","v":0},{"$f":"Journal!C39","v":0},{"$f":"Journal!D39","v":0},13,0,0,0,0]
[null,null,null,{"$f":"Journal!A40","v":0},{"$f":"Journal!B40","v":0},{"$f":"Journal!C40","v":0},{"$f":"Journal!D40","v":0},13,0,0,0,0]
[null,null,null,{"$f":"Journal!A41","v":0},{"$f":"Journal!B41","v":0},{"$f":"Journal!C41","v":0},{"$f":"Journal!D41","v":0},13,0,0,0,0]
[null,null,null,{"$f":"Journal!A42","v":0},{"$f":"Journal!B42","v":0},{"$f":"Journal!C42","v":0},{"$f":"Journal!D42","v":0},13,0,0,0,0]
[null,null,null,{"$f":"Journal!A43","v":0},{"$f":"Journal!B43","v":0},{"$f":"Journal!C43","v":0},{"$f":"Journal!D43","v":0},13,0,0,0,0]
[null,null,null,{"$f":"Journal!A44","v":0},{"$f":"Journal!B44","v":0},{"$f":"Journal!C44","v":0},{"$f":"Journal!D44","v":0},13,0,0,0,0]
[null,null,null,{"$f":"Journal!A45","v":0},{"$f":"Journal!B45","v":0},{"$f":"Journal!C45","v":0},{"$f":"Journal!D45","v":0},13,0,0,0,0]
[null,null,null,{"$f":"Journal!A46","v":0},{"$f":"Journal!B46","v":0},{"$f":"Journal!C46","v":0},{"$f":"Journal!D46","v":0},13,0,0,0,0]
[null,null,null,{"$f":"Journal!A47","v":0},{"$f":"Journal!B47","v":0},{"$f":"Journal!C47","v":0},{"$f":"Journal!D47","v":0},13,0,0,0,0]
[null,null,null,{"$f":"Journal!A48","v":0},{"$f":"Journal!B48","v":0},{"$f":"Journal!C48","v":0},{"$f":"Journal!D48","v":0},13,0,0,0,0]
[null,null,null,{"$f":"Journal!A49","v":0},{"$f":"Journal!B49","v":0},{"$f":"Journal!C49","v":0},{"$f":"Journal!D49","v":0},13,0,0,0,0]
[null,null,null,{"$f":"Journal!A50","v":0},{"$f":"Journal!B50","v":0},{"$f":"Journal!C50","v":0},{"$f":"Journal!D50","v":0},13,0,0,0,0]
[null,null,null,{"$f":"Journal!A51","v":0},{"$f":"Journal!B51","v":0},{"$f":"Journal!C51","v":0},{"$f":"Journal!D51","v":0},13,0,0,0,0]
[null,null,null,{"$f":"Journal!A52","v":0},{"$f":"Journal!B52","v":0},{"$f":"Journal!C52","v":0},{"$f":"Journal!D52","v":0},13,0,0,0,0]
[null,null,null,{"$f":"Journal!A53","v":0},{"$f":"Journal!B53","v":0},{"$f":"Journal!C53","v":0},{"$f":"Journal!D53","v":0},13,0,0,0,0]
[null,null,null,{"$f":"Journal!A54","v":0},{"$f":"Journal!B54","v":0},{"$f":"Journal!C54","v":0},{"$f":"Journal!D54","v":0},13,0,0,0,0]
[null,null,null,{"$f":"Journal!A55","v":0},{"$f":"Journal!B55","v":0},{"$f":"Journal!C55","v":0},{"$f":"Journal!D55","v":0},13,0,0,0,0]
[null,null,null,{"$f":"Journal!A56","v":0},{"$f":"Journal!B56","v":0},{"$f":"Journal!C56","v":0},{"$f":"Journal!D56","v":0},13,0,0,0,0]
[null,null,null,{"$f":"Journal!A57","v":0},{"$f":"Journal!B57","v":0},{"$f":"Journal!C57","v":0},{"$f":"Journal!D57","v":0},13,0,0,0,0]
[null,null,null,{"$f":"Journal!A58","v":0},{"$f":"Journal!B58","v":0},{"$f":"Journal!C58","v":0},{"$f":"Journal!D58","v":0},13,0,0,0,0]
[null,null,null,{"$f":"Journal!A59","v":0},{"$f":"Journal!B59","v":0},{"$f":"Journal!C59","v":0},{"$f":"Journal!D59","v":0},13,0,0,0,0]
[null,null,null,{"$f":"Journal!A60","v":0},{"$f":"Journal!B60","v":0},{"$f":"Journal!C60","v":0},{"$f":"Journal!D60","v":0},13,0,0,0,0]
[null,null,null,{"$f":"Journal!A61","v":0},{"$f":"Journal!B61","v":0},{"$f":"Journal!C61","v":0},{"$f":"Journal!D61","v":0},13,0,0,0,0]
[null,null,null,{"$f":"Journal!A62","v":0},{"$f":"Journal!B62","v":0},{"$f":"Journal!C62","v":0},{"$f":"Journal!D62","v":0},13,0,0,0,0]
[null,null,null,{"$f":"Journal!A63","v":0},{"$f":"Journal!B63","v":0},{"$f":"Journal!C63","v":0},{"$f":"Journal!D63","v":0},13,0,0,0,0]
[null,null,null,{"$f":"Journal!A64","v":0},{"$f":"Journal!B64","v":0},{"$f":"Journal!C64","v":0},{"$f":"Journal!D64","v":0},13,0,0,0,0]
[null,null,null,{"$f":"Journal!A65","v":0},{"$f":"Journal!B65","v":0},{"$f":"Journal!C65","v":0},{"$f":"Journal!D65","v":0},13,0,0,0,0]
[null,null,null,{"$f":"Journal!A66","v":0},{"$f":"Journal!B66","v":0},{"$f":"Journal!C66","v":0},{"$f":"Journal!D66","v":0},13,0,0,0,0]
[null,null,null,{"$f":"Journal!A67","v":0},{"$f":"Journal!B67","v":0},{"$f":"Journal!C67","v":0},{"$f":"Journal!D67","v":0},13,0,0,0,0]
[null,null,null,{"$f":"Journal!A68","v":0},{"$f":"Journal!B68","v":0},{"$f":"Journal!C68","v":0},{"$f":"Journal!D68","v":0},13,0,0,0,0]
[null,null,null,{"$f":"Journal!A69","v":0},{"$f":"Journal!B69","v":0},{"$f":"Journal!C69","v":0},{"$f":"Journal!D69","v":0},{"$f":"12-G88+1","v":13},{"$f":"IF(AND(E88=0,F88=0),0,IF(1/F88*2.5>25%,25%,1/F88*2.5))","v":0},{"$f":"E88/5","v":0},{"$f":"IF($E88<410.01,$E88,$E88/$F88/12*$H88)","v":0},{"$f":"IF($E88<410.01,$E88,$E88*I88/1/12*$H88)","v":0}]
[null,null,null,{"$f":"Journal!A70","v":0},{"$f":"Journal!B70","v":0},{"$f":"Journal!C70","v":0},{"$f":"Journal!D70","v":0},13,0,0,0,0]
[null,null,null,{"$f":"Journal!A71","v":0},{"$f":"Journal!B71","v":0},{"$f":"Journal!C71","v":0},{"$f":"Journal!D71","v":0},13,0,0,0,0]
[null,null,null,{"$f":"Journal!A72","v":0},{"$f":"Journal!B72","v":0},{"$f":"Journal!C72","v":0},{"$f":"Journal!D72","v":0},13,0,0,0,0]
[null,null,null,{"$f":"Journal!A73","v":0},{"$f":"Journal!B73","v":0},{"$f":"Journal!C73","v":0},{"$f":"Journal!D73","v":0},13,0,0,0,0]
[null,null,null,{"$f":"Journal!A74","v":0},{"$f":"Journal!B74","v":0},{"$f":"Journal!C74","v":0},{"$f":"Journal!D74","v":0},13,0,0,0,0]
[null,null,null,{"$f":"Journal!A75","v":0},{"$f":"Journal!B75","v":0},{"$f":"Journal!C75","v":0},{"$f":"Journal!D75","v":0},13,0,0,0,0]
[null,null,null,{"$f":"Journal!A76","v":0},{"$f":"Journal!B76","v":0},{"$f":"Journal!C76","v":0},{"$f":"Journal!D76","v":0},13,0,0,0,0]
[null,null,null,{"$f":"Journal!A77","v":0},{"$f":"Journal!B77","v":0},{"$f":"Journal!C77","v":0},{"$f":"Journal!D77","v":0},13,0,0,0,0]
[null,null,null,{"$f":"Journal!A78","v":0},{"$f":"Journal!B78","v":0},{"$f":"Journal!C78","v":0},{"$f":"Journal!D78","v":0},13,0,0,0,0]
[null,null,null,{"$f":"Journal!A79","v":0},{"$f":"Journal!B79","v":0},{"$f":"Journal!C79","v":0},{"$f":"Journal!D79","v":0},13,0,0,0,0]
[null,null,null,{"$f":"Journal!A80","v":0},{"$f":"Journal!B80","v":0},{"$f":"Journal!C80","v":0},{"$f":"Journal!D80","v":0},13,0,0,0,0]
[null,null,null,{"$f":"Journal!A81","v":0},{"$f":"Journal!B81","v":0},{"$f":"Journal!C81","v":0},{"$f":"Journal!D81","v":0},13,0,0,0,0]
[null,null,null,{"$f":"Journal!A82","v":0},{"$f":"Journal!B82","v":0},{"$f":"Journal!C82","v":0},{"$f":"Journal!D82","v":0},13,0,0,0,0]
[null,null,null,{"$f":"Journal!A83","v":0},{"$f":"Journal!B83","v":0},{"$f":"Journal!C83","v":0},{"$f":"Journal!D83","v":0},13,0,0,0,0]
[null,null,null,{"$f":"Journal!A84","v":0},{"$f":"Journal!B84","v":0},{"$f":"Journal!C84","v":0},{"$f":"Journal!D84","v":0},13,0,0,0,0]
[null,null,null,{"$f":"Journal!A85","v":0},{"$f":"Journal!B85","v":0},{"$f":"Journal!C85","v":0},{"$f":"Journal!D85","v":0},13,0,0,0,0]
[null,null,null,{"$f":"Journal!A86","v":0},{"$f":"Journal!B86","v":0},{"$f":"Journal!C86","v":0},{"$f":"Journal!D86","v":0},13,0,0,0,0]
[null,null,null,{"$f":"Journal!A87","v":0},{"$f":"Journal!B87","v":0},{"$f":"Journal!C87","v":0},{"$f":"Journal!D87","v":0},13,0,0,0,0]
[null,null,null,{"$f":"Journal!A88","v":0},{"$f":"Journal!B88","v":0},{"$f":"Journal!C88","v":0},{"$f":"Journal!D88","v":0},13,0,0,0,0]
[null,null,null,{"$f":"Journal!A89","v":0},{"$f":"Journal!B89","v":0},{"$f":"Journal!C89","v":0},{"$f":"Journal!D89","v":0},13,0,0,0,0]
[null,null,null,{"$f":"Journal!A90","v":0},{"$f":"Journal!B90","v":0},{"$f":"Journal!C90","v":0},{"$f":"Journal!D90","v":0},13,0,0,0,0]
[null,null,null,{"$f":"Journal!A91","v":0},{"$f":"Journal!B91","v":0},{"$f":"Journal!C91","v":0},{"$f":"Journal!D91","v":0},13,0,0,0,0]
[null,null,null,{"$f":"Journal!A92","v":0},{"$f":"Journal!B92","v":0},{"$f":"Journal!C92","v":0},{"$f":"Journal!D92","v":0},13,0,0,0,0]
[null,null,null,{"$f":"Journal!A93","v":0},{"$f":"Journal!B93","v":0},{"$f":"Journal!C93","v":0},{"$f":"Journal!D93","v":0},13,0,0,0,0]
[null,null,null,{"$f":"Journal!A94","v":0},{"$f":"Journal!B94","v":0},{"$f":"Journal!C94","v":0},{"$f":"Journal!D94","v":0},13,0,0,0,0]
[null,null,null,{"$f":"Journal!A95","v":0},{"$f":"Journal!B95","v":0},{"$f":"Journal!C95","v":0},{"$f":"Journal!D95","v":0},13,0,0,0,0]
[null,null,null,{"$f":"Journal!A96","v":0},{"$f":"Journal!B96","v":0},{"$f":"Journal!C96","v":0},{"$f":"Journal!D96","v":0},13,0,0,0,0]
[null,null,null,{"$f":"Journal!A97","v":0},{"$f":"Journal!B97","v":0},{"$f":"Journal!C97","v":0},{"$f":"Journal!D97","v":0},13,0,0,0,0]
[null,null,null,{"$f":"Journal!A98","v":0},{"$f":"Journal!B98","v":0},{"$f":"Journal!C98","v":0},{"$f":"Journal!D98","v":0},13,0,0,0,0]
[null,null,null,{"$f":"Journal!A99","v":0},{"$f":"Journal!B99","v":0},{"$f":"Journal!C99","v":0},{"$f":"Journal!D99","v":0},13,0,0,0,0]
[null,null,null,{"$f":"Journal!A100","v":0},{"$f":"Journal!B100","v":0},{"$f":"Journal!C100","v":0},{"$f":"Journal!D100","v":0},13,0,0,0,0]
[null,null,null,{"$f":"Journal!A101","v":0},{"$f":"Journal!B101","v":0},{"$f":"Journal!C101","v":0},{"$f":"Journal!D101","v":0},13,0,0,0,0]
[null,null,null,{"$f":"Journal!A102","v":0},{"$f":"Journal!B102","v":0},{"$f":"Journal!C102","v":0},{"$f":"Journal!D102","v":0},13,0,0,0,0]
[null,null,null,{"$f":"Journal!A103","v":0},{"$f":"Journal!B103","v":0},{"$f":"Journal!C103","v":0},{"$f":"Journal!D103","v":0},13,0,0,0,0]
[null,null,null,{"$f":"Journal!A104","v":0},{"$f":"Journal!B104","v":0},{"$f":"Journal!C104","v":0},{"$f":"Journal!D104","v":0},13,0,0,0,0]
[null,null,null,{"$f":"Journal!A105","v":0},{"$f":"Journal!B105","v":0},{"$f":"Journal!C105","v":0},{"$f":"Journal!D105","v":0},13,0,0,0,0]
[null,null,null,{"$f":"Journal!A106","v":0},{"$f":"Journal!B106","v":0},{"$f":"Journal!C106","v":0},{"$f":"Journal!D106","v":0},13,0,0,0,0]
[null,null,null,{"$f":"Journal!A107","v":0},{"$f":"Journal!B107","v":0},{"$f":"Journal!C107","v":0},{"$f":"Journal!D107","v":0},13,0,0,0,0]
[null,null,null,{"$f":"Journal!A108","v":0},{"$f":"Journal!B108","v":0},{"$f":"Journal!C108","v":0},{"$f":"Journal!D108","v":0},13,0,0,0,0]
[null,null,null,{"$f":"Journal!A109","v":0},{"$f":"Journal!B109","v":0},{"$f":"Journal!C109","v":0},{"$f":"Journal!D109","v":0},13,0,0,0,0]
[null,null,null,{"$f":"Journal!A110","v":0},{"$f":"Journal!B110","v":0},{"$f":"Journal!C110","v":0},{"$f":"Journal!D110","v":0},13,0,0,0,0]
[null,null,null,{"$f":"Journal!A111","v":0},{"$f":"Journal!B111","v":0},{"$f":"Journal!C111","v":0},{"$f":"Journal!D111","v":0},13,0,0,0,0]
[null,null,null,{"$f":"Journal!A112","v":0},{"$f":"Journal!B112","v":0},{"$f":"Journal!C112","v":0},{"$f":"Journal!D112","v":0},13,0,0,0,0]
[null,null,null,{"$f":"Journal!A113","v":0},{"$f":"Journal!B113","v":0},{"$f":"Journal!C113","v":0},{"$f":"Journal!D113","v":0},13,0,0,0,0]
[null,null,null,{"$f":"Journal!A114","v":0},{"$f":"Journal!B114","v":0},{"$f":"Journal!C114","v":0},{"$f":"Journal!D114","v":0},13,0,0,0,0]
[null,null,null,{"$f":"Journal!A115","v":0},{"$f":"Journal!B115","v":0},{"$f":"Journal!C115","v":0},{"$f":"Journal!D115","v":0},13,0,0,0,0]
[null,null,null,{"$f":"Journal!A116","v":0},{"$f":"Journal!B116","v":0},{"$f":"Journal!C116","v":0},{"$f":"Journal!D116","v":0},13,0,0,0,0]
[null,null,null,{"$f":"Journal!A117","v":0},{"$f":"Journal!B117","v":0},{"$f":"Journal!C117","v":0},{"$f":"Journal!D117","v":0},13,0,0,0,0]
[null,null,null,{"$f":"Journal!A118","v":0},{"$f":"Journal!B118","v":0},{"$f":"Journal!C118","v":0},{"$f":"Journal!D118","v":0},13,0,0,0,0]
[null,null,null,{"$f":"Journal!A119","v":0},{"$f":"Journal!B119","v":0},{"$f":"Journal!C119","v":0},{"$f":"Journal!D119","v":0},13,0,0,0,0]
[null,null,null,{"$f":"Journal!A120","v":0},{"$f":"Journal!B120","v":0},{"$f":"Journal!C120","v":0},{"$f":"Journal!D120","v":0},13,0,0,0,0]
[null,null,null,{"$f":"Journal!A121","v":0},{"$f":"Journal!B121","v":0},{"$f":"Journal!C121","v":0},{"$f":"Journal!D121","v":0},13,0,0,0,0]
[null,null,null,{"$f":"Journal!A122","v":0},{"$f":"Journal!B122","v":0},{"$f":"Journal!C122","v":0},{"$f":"Journal!D122","v":0},13,0,0,0,0]
[null,null,null,{"$f":"Journal!A123","v":0},{"$f":"Journal!B123","v":0},{"$f":"Journal!C123","v":0},{"$f":"Journal!D123","v":0},13,0,0,0,0]
[null,null,null,{"$f":"Journal!A124","v":0},{"$f":"Journal!B124","v":0},{"$f":"Journal!C124","v":0},{"$f":"Journal!D124","v":0},13,0,0,0,0]
[null,null,null,{"$f":"Journal!A125","v":0},{"$f":"Journal!B125","v":0},{"$f":"Journal!C125","v":0},{"$f":"Journal!D125","v":0},13,0,0,0,0]
[null,null,null,{"$f":"Journal!A126","v":0},{"$f":"Journal!B126","v":0},{"$f":"Journal!C126","v":0},{"$f":"Journal!D126","v":0},13,0,0,0,0]
[null,null,null,{"$f":"Journal!A127","v":0},{"$f":"Journal!B127","v":0},{"$f":"Journal!C127","v":0},{"$f":"Journal!D127","v":0},13,0,0,0,0]
[null,null,null,{"$f":"Journal!A128","v":0},{"$f":"Journal!B128","v":0},{"$f":"Journal!C128","v":0},{"$f":"Journal!D128","v":0},13,0,0,0,0]
[null,null,null,{"$f":"Journal!A129","v":0},{"$f":"Journal!B129","v":0},{"$f":"Journal!C129","v":0},{"$f":"Journal!D129","v":0},13,0,0,0,0]
[null,null,null,{"$f":"Journal!A130","v":0},{"$f":"Journal!B130","v":0},{"$f":"Journal!C130","v":0},{"$f":"Journal!D130","v":0},13,0,0,0,0]
[null,null,null,{"$f":"Journal!A131","v":0},{"$f":"Journal!B131","v":0},{"$f":"Journal!C131","v":0},{"$f":"Journal!D131","v":0},13,0,0,0,0]
[null,null,null,{"$f":"Journal!A132","v":0},{"$f":"Journal!B132","v":0},{"$f":"Journal!C132","v":0},{"$f":"Journal!D132","v":0},13,0,0,0,0]
[null,null,null,{"$f":"Journal!A133","v":0},{"$f":"Journal!B133","v":0},{"$f":"Journal!C133","v":0},{"$f":"Journal!D133","v":0},{"$f":"12-G152+1","v":13},{"$f":"IF(AND(E152=0,F152=0),0,IF(1/F152*2.5>25%,25%,1/F152*2.5))","v":0},{"$f":"E152/5","v":0},{"$f":"IF($E152<410.01,$E152,$E152/$F152/12*$H152)","v":0},{"$f":"IF($E152<410.01,$E152,$E152*I152/1/12*$H152)","v":0}]
[null,null,null,{"$f":"Journal!A134","v":0},{"$f":"Journal!B134","v":0},{"$f":"Journal!C134","v":0},{"$f":"Journal!D134","v":0},13,0,0,0,0]
[null,null,null,{"$f":"Journal!A135","v":0},{"$f":"Journal!B135","v":0},{"$f":"Journal!C135","v":0},{"$f":"Journal!D135","v":0},13,0,0,0,0]
[null,null,null,{"$f":"Journal!A136","v":0},{"$f":"Journal!B136","v":0},{"$f":"Journal!C136","v":0},{"$f":"Journal!D136","v":0},13,0,0,0,0]
[null,null,null,{"$f":"Journal!A137","v":0},{"$f":"Journal!B137","v":0},{"$f":"Journal!C137","v":0},{"$f":"Journal!D137","v":0},13,0,0,0,0]
[null,null,null,{"$f":"Journal!A138","v":0},{"$f":"Journal!B138","v":0},{"$f":"Journal!C138","v":0},{"$f":"Journal!D138","v":0},13,0,0,0,0]
[null,null,null,{"$f":"Journal!A139","v":0},{"$f":"Journal!B139","v":0},{"$f":"Journal!C139","v":0},{"$f":"Journal!D139","v":0},13,0,0,0,0]
[null,null,null,{"$f":"Journal!A140","v":0},{"$f":"Journal!B140","v":0},{"$f":"Journal!C140","v":0},{"$f":"Journal!D140","v":0},13,0,0,0,0]
[null,null,null,{"$f":"Journal!A141","v":0},{"$f":"Journal!B141","v":0},{"$f":"Journal!C141","v":0},{"$f":"Journal!D141","v":0},13,0,0,0,0]
[null,null,null,{"$f":"Journal!A142","v":0},{"$f":"Journal!B142","v":0},{"$f":"Journal!C142","v":0},{"$f":"Journal!D142","v":0},13,0,0,0,0]
[null,null,null,{"$f":"Journal!A143","v":0},{"$f":"Journal!B143","v":0},{"$f":"Journal!C143","v":0},{"$f":"Journal!D143","v":0},13,0,0,0,0]
[null,null,null,{"$f":"Journal!A144","v":0},{"$f":"Journal!B144","v":0},{"$f":"Journal!C144","v":0},{"$f":"Journal!D144","v":0},13,0,0,0,0]
[null,null,null,{"$f":"Journal!A145","v":0},{"$f":"Journal!B145","v":0},{"$f":"Journal!C145","v":0},{"$f":"Journal!D145","v":0},13,0,0,0,0]
[null,null,null,{"$f":"Journal!A146","v":0},{"$f":"Journal!B146","v":0},{"$f":"Journal!C146","v":0},{"$f":"Journal!D146","v":0},13,0,0,0,0]
[null,null,null,{"$f":"Journal!A147","v":0},{"$f":"Journal!B147","v":0},{"$f":"Journal!C147","v":0},{"$f":"Journal!D147","v":0},13,0,0,0,0]
[null,null,null,{"$f":"Journal!A148","v":0},{"$f":"Journal!B148","v":0},{"$f":"Journal!C148","v":0},{"$f":"Journal!D148","v":0},13,0,0,0,0]
[null,null,null,{"$f":"Journal!A149","v":0},{"$f":"Journal!B149","v":0},{"$f":"Journal!C149","v":0},{"$f":"Journal!D149","v":0},13,0,0,0,0]
[null,null,null,{"$f":"Journal!A150","v":0},{"$f":"Journal!B150","v":0},{"$f":"Journal!C150","v":0},{"$f":"Journal!D150","v":0},13,0,0,0,0]
[null,null,null,{"$f":"Journal!A151","v":0},{"$f":"Journal!B151","v":0},{"$f":"Journal!C151","v":0},{"$f":"Journal!D151","v":0},13,0,0,0,0]
[null,null,null,{"$f":"Journal!A152","v":0},{"$f":"Journal!B152","v":0},{"$f":"Journal!C152","v":0},{"$f":"Journal!D152","v":0},13,0,0,0,0]
[null,null,null,{"$f":"Journal!A153","v":0},{"$f":"Journal!B153","v":0},{"$f":"Journal!C153","v":0},{"$f":"Journal!D153","v":0},13,0,0,0,0]
[null,null,null,{"$f":"Journal!A154","v":0},{"$f":"Journal!B154","v":0},{"$f":"Journal!C154","v":0},{"$f":"Journal!D154","v":0},13,0,0,0,0]
[null,null,null,{"$f":"Journal!A155","v":0},{"$f":"Journal!B155","v":0},{"$f":"Journal!C155","v":0},{"$f":"Journal!D155","v":0},13,0,0,0,0]
[null,null,null,{"$f":"Journal!A156","v":0},{"$f":"Journal!B156","v":0},{"$f":"Journal!C156","v":0},{"$f":"Journal!D156","v":0},13,0,0,0,0]
[null,null,null,{"$f":"Journal!A157","v":0},{"$f":"Journal!B157","v":0},{"$f":"Journal!C157","v":0},{"$f":"Journal!D157","v":0},13,0,0,0,0]
[null,null,null,{"$f":"Journal!A158","v":0},{"$f":"Journal!B158","v":0},{"$f":"Journal!C158","v":0},{"$f":"Journal!D158","v":0},13,0,0,0,0]
[null,null,null,{"$f":"Journal!A159","v":0},{"$f":"Journal!B159","v":0},{"$f":"Journal!C159","v":0},{"$f":"Journal!D159","v":0},13,0,0,0,0]
[null,null,null,{"$f":"Journal!A160","v":0},{"$f":"Journal!B160","v":0},{"$f":"Journal!C160","v":0},{"$f":"Journal!D160","v":0},13,0,0,0,0]
[null,null,null,{"$f":"Journal!A161","v":0},{"$f":"Journal!B161","v":0},{"$f":"Journal!C161","v":0},{"$f":"Journal!D161","v":0},13,0,0,0,0]
[null,null,null,{"$f":"Journal!A162","v":0},{"$f":"Journal!B162","v":0},{"$f":"Journal!C162","v":0},{"$f":"Journal!D162","v":0},13,0,0,0,0]
[null,null,null,{"$f":"Journal!A163","v":0},{"$f":"Journal!B163","v":0},{"$f":"Journal!C163","v":0},{"$f":"Journal!D163","v":0},13,0,0,0,0]
[null,null,null,{"$f":"Journal!A164","v":0},{"$f":"Journal!B164","v":0},{"$f":"Journal!C164","v":0},{"$f":"Journal!D164","v":0},13,0,0,0,0]
[null,null,null,{"$f":"Journal!A165","v":0},{"$f":"Journal!B165","v":0},{"$f":"Journal!C165","v":0},{"$f":"Journal!D165","v":0},13,0,0,0,0]
[null,null,null,{"$f":"Journal!A166","v":0},{"$f":"Journal!B166","v":0},{"$f":"Journal!C166","v":0},{"$f":"Journal!D166","v":0},13,0,0,0,0]
[null,null,null,{"$f":"Journal!A167","v":0},{"$f":"Journal!B167","v":0},{"$f":"Journal!C167","v":0},{"$f":"Journal!D167","v":0},13,0,0,0,0]
[null,null,null,{"$f":"Journal!A168","v":0},{"$f":"Journal!B168","v":0},{"$f":"Journal!C168","v":0},{"$f":"Journal!D168","v":0},13,0,0,0,0]
[null,null,null,{"$f":"Journal!A169","v":0},{"$f":"Journal!B169","v":0},{"$f":"Journal!C169","v":0},{"$f":"Journal!D169","v":0},13,0,0,0,0]
[null,null,null,{"$f":"Journal!A170","v":0},{"$f":"Journal!B170","v":0},{"$f":"Journal!C170","v":0},{"$f":"Journal!D170","v":0},13,0,0,0,0]
[null,null,null,{"$f":"Journal!A171","v":0},{"$f":"Journal!B171","v":0},{"$f":"Journal!C171","v":0},{"$f":"Journal!D171","v":0},13,0,0,0,0]
[null,null,null,{"$f":"Journal!A172","v":0},{"$f":"Journal!B172","v":0},{"$f":"Journal!C172","v":0},{"$f":"Journal!D172","v":0},13,0,0,0,0]
[null,null,null,{"$f":"Journal!A173","v":0},{"$f":"Journal!B173","v":0},{"$f":"Journal!C173","v":0},{"$f":"Journal!D173","v":0},13,0,0,0,0]
[null,null,null,{"$f":"Journal!A174","v":0},{"$f":"Journal!B174","v":0},{"$f":"Journal!C174","v":0},{"$f":"Journal!D174","v":0},13,0,0,0,0]
[null,null,null,{"$f":"Journal!A175","v":0},{"$f":"Journal!B175","v":0},{"$f":"Journal!C175","v":0},{"$f":"Journal!D175","v":0},13,0,0,0,0]
[null,null,null,{"$f":"Journal!A176","v":0},{"$f":"Journal!B176","v":0},{"$f":"Journal!C176","v":0},{"$f":"Journal!D176","v":0},13,0,0,0,0]
[null,null,null,{"$f":"Journal!A177","v":0},{"$f":"Journal!B177","v":0},{"$f":"Journal!C177","v":0},{"$f":"Journal!D177","v":0},13,0,0,0,0]
[null,null,null,{"$f":"Journal!A178","v":0},{"$f":"Journal!B178","v":0},{"$f":"Journal!C178","v":0},{"$f":"Journal!D178","v":0},13,0,0,0,0]
[null,null,null,{"$f":"Journal!A179","v":0},{"$f":"Journal!B179","v":0},{"$f":"Journal!C179","v":0},{"$f":"Journal!D179","v":0},13,0,0,0,0]
[null,null,null,{"$f":"Journal!A180","v":0},{"$f":"Journal!B180","v":0},{"$f":"Journal!C180","v":0},{"$f":"Journal!D180","v":0},13,0,0,0,0]
[null,null,null,{"$f":"Journal!A181","v":0},{"$f":"Journal!B181","v":0},{"$f":"Journal!C181","v":0},{"$f":"Journal!D181","v":0},13,0,0,0,0]
[null,null,null,{"$f":"Journal!A182","v":0},{"$f":"Journal!B182","v":0},{"$f":"Journal!C182","v":0},{"$f":"Journal!D182","v":0},13,0,0,0,0]
[null,null,null,{"$f":"Journal!A183","v":0},{"$f":"Journal!B183","v":0},{"$f":"Journal!C183","v":0},{"$f":"Journal!D183","v":0},13,0,0,0,0]
[null,null,null,{"$f":"Journal!A184","v":0},{"$f":"Journal!B184","v":0},{"$f":"Journal!C184","v":0},{"$f":"Journal!D184","v":0},13,0,0,0,0]
[null,null,null,{"$f":"Journal!A185","v":0},{"$f":"Journal!B185","v":0},{"$f":"Journal!C185","v":0},{"$f":"Journal!D185","v":0},13,0,0,0,0]
[null,null,null,{"$f":"Journal!A186","v":0},{"$f":"Journal!B186","v":0},{"$f":"Journal!C186","v":0},{"$f":"Journal!D186","v":0},13,0,0,0,0]
[null,null,null,{"$f":"Journal!A187","v":0},{"$f":"Journal!B187","v":0},{"$f":"Journal!C187","v":0},{"$f":"Journal!D187","v":0},13,0,0,0,0]
[null,null,null,{"$f":"Journal!A188","v":0},{"$f":"Journal!B188","v":0},{"$f":"Journal!C188","v":0},{"$f":"Journal!D188","v":0},13,0,0,0,0]
[null,null,null,{"$f":"Journal!A189","v":0},{"$f":"Journal!B189","v":0},{"$f":"Journal!C189","v":0},{"$f":"Journal!D189","v":0},13,0,0,0,0]
[null,null,null,{"$f":"Journal!A190","v":0},{"$f":"Journal!B190","v":0},{"$f":"Journal!C190","v":0},{"$f":"Journal!D190","v":0},13,0,0,0,0]
[null,null,null,{"$f":"Journal!A191","v":0},{"$f":"Journal!B191","v":0},{"$f":"Journal!C191","v":0},{"$f":"Journal!D191","v":0},13,0,0,0,0]
[null,null,null,{"$f":"Journal!A192","v":0},{"$f":"Journal!B192","v":0},{"$f":"Journal!C192","v":0},{"$f":"Journal!D192","v":0},13,0,0,0,0]
[null,null,null,{"$f":"Journal!A193","v":0},{"$f":"Journal!B193","v":0},{"$f":"Journal!C193","v":0},{"$f":"Journal!D193","v":0},13,0,0,0,0]
[null,null,null,{"$f":"Journal!A194","v":0},{"$f":"Journal!B194","v":0},{"$f":"Journal!C194","v":0},{"$f":"Journal!D194","v":0},13,0,0,0,0]
[null,null,null,{"$f":"Journal!A195","v":0},{"$f":"Journal!B195","v":0},{"$f":"Journal!C195","v":0},{"$f":"Journal!D195","v":0},13,0,0,0,0]
[null,null,null,{"$f":"Journal!A196","v":0},{"$f":"Journal!B196","v":0},{"$f":"Journal!C196","v":0},{"$f":"Journal!D196","v":0},13,0,0,0,0]
[null,null,null,{"$f":"Journal!A197","v":0},{"$f":"Journal!B197","v":0},{"$f":"Journal!C197","v":0},{"$f":"Journal!D197","v":0},{"$f":"12-G216+1","v":13},{"$f":"IF(AND(E216=0,F216=0),0,IF(1/F216*2.5>25%,25%,1/F216*2.5))","v":0},{"$f":"E216/5","v":0},{"$f":"IF($E216<410.01,$E216,$E216/$F216/12*$H216)","v":0},{"$f":"IF($E216<410.01,$E216,$E216*I216/1/12*$H216)","v":0}]
[null,null,null,{"$f":"Journal!A198","v":0},{"$f":"Journal!B198","v":0},{"$f":"Journal!C198","v":0},{"$f":"Journal!D198","v":0},13,0,0,0,0]
[null,null,null,{"$f":"Journal!A199","v":0},{"$f":"Journal!B199","v":0},{"$f":"Journal!C199","v":0},{"$f":"Journal!D199","v":0},13,0,0,0,0]
[null,null,null,{"$f":"Journal!A200","v":0},{"$f":"Journal!B200","v":0},{"$f":"Journal!C200","v":0},{"$f":"Journal!D200","v":0},13,0,0,0,0]
[null,null,null,{"$f":"Journal!A201","v":0},{"$f":"Journal!B201","v":0},{"$f":"Journal!C201","v":0},{"$f":"Journal!D201","v":0},13,0,0,0,0]
[null,null,null,{"$f":"Journal!A202","v":0},{"$f":"Journal!B202","v":0},{"$f":"Journal!C202","v":0},{"$f":"Journal!D202","v":0},13,0,0,0,0]
[null,null,null,{"$f":"Journal!A203","v":0},{"$f":"Journal!B203","v":0},{"$f":"Journal!C203","v":0},{"$f":"Journal!D203","v":0},13,0,0,0,0]
[null,null,null,{"$f":"Journal!A204","v":0},{"$f":"Journal!B204","v":0},{"$f":"Journal!C204","v":0},{"$f":"Journal!D204","v":0},13,0,0,0,0]
[null,null,null,{"$f":"Journal!A205","v":0},{"$f":"Journal!B205","v":0},{"$f":"Journal!C205","v":0},{"$f":"Journal!D205","v":0},13,0,0,0,0]
[null,null,null,{"$f":"Journal!A206","v":0},{"$f":"Journal!B206","v":0},{"$f":"Journal!C206","v":0},{"$f":"Journal!D206","v":0},13,0,0,0,0]
[null,null,null,{"$f":"Journal!A207","v":0},{"$f":"Journal!B207","v":0},{"$f":"Journal!C207","v":0},{"$f":"Journal!D207","v":0},13,0,0,0,0]
[null,null,null,{"$f":"Journal!A208","v":0},{"$f":"Journal!B208","v":0},{"$f":"Journal!C208","v":0},{"$f":"Journal!D208","v":0},13,0,0,0,0]
[null,null,null,{"$f":"Journal!A209","v":0},{"$f":"Journal!B209","v":0},{"$f":"Journal!C209","v":0},{"$f":"Journal!D209","v":0},13,0,0,0,0]
[null,null,null,{"$f":"Journal!A210","v":0},{"$f":"Journal!B210","v":0},{"$f":"Journal!C210","v":0},{"$f":"Journal!D210","v":0},13,0,0,0,0]
[null,null,null,{"$f":"Journal!A211","v":0},{"$f":"Journal!B211","v":0},{"$f":"Journal!C211","v":0},{"$f":"Journal!D211","v":0},13,0,0,0,0]
[null,null,null,{"$f":"Journal!A212","v":0},{"$f":"Journal!B212","v":0},{"$f":"Journal!C212","v":0},{"$f":"Journal!D212","v":0},13,0,0,0,0]
[null,null,null,{"$f":"Journal!A213","v":0},{"$f":"Journal!B213","v":0},{"$f":"Journal!C213","v":0},{"$f":"Journal!D213","v":0},13,0,0,0,0]
[null,null,null,{"$f":"Journal!A214","v":0},{"$f":"Journal!B214","v":0},{"$f":"Journal!C214","v":0},{"$f":"Journal!D214","v":0},13,0,0,0,0]
[null,null,null,{"$f":"Journal!A215","v":0},{"$f":"Journal!B215","v":0},{"$f":"Journal!C215","v":0},{"$f":"Journal!D215","v":0},13,0,0,0,0]
[null,null,null,{"$f":"Journal!A216","v":0},{"$f":"Journal!B216","v":0},{"$f":"Journal!C216","v":0},{"$f":"Journal!D216","v":0},13,0,0,0,0]
[null,null,null,{"$f":"Journal!A217","v":0},{"$f":"Journal!B217","v":0},{"$f":"Journal!C217","v":0},{"$f":"Journal!D217","v":0},13,0,0,0,0]
[null,null,null,{"$f":"Journal!A218","v":0},{"$f":"Journal!B218","v":0},{"$f":"Journal!C218","v":0},{"$f":"Journal!D218","v":0},13,0,0,0,0]
[null,null,null,{"$f":"Journal!A219","v":0},{"$f":"Journal!B219","v":0},{"$f":"Journal!C219","v":0},{"$f":"Journal!D219","v":0},13,0,0,0,0]
[null,null,null,{"$f":"Journal!A220","v":0},{"$f":"Journal!B220","v":0},{"$f":"Journal!C220","v":0},{"$f":"Journal!D220","v":0},13,0,0,0,0]
[null,null,null,{"$f":"Journal!A221","v":0},{"$f":"Journal!B221","v":0},{"$f":"Journal!C221","v":0},{"$f":"Journal!D221","v":0},13,0,0,0,0]
[null,null,null,{"$f":"Journal!A222","v":0},{"$f":"Journal!B222","v":0},{"$f":"Journal!C222","v":0},{"$f":"Journal!D222","v":0},13,0,0,0,0]
[null,null,null,{"$f":"Journal!A223","v":0},{"$f":"Journal!B223","v":0},{"$f":"Journal!C223","v":0},{"$f":"Journal!D223","v":0},13,0,0,0,0]
[null,null,null,{"$f":"Journal!A224","v":0},{"$f":"Journal!B224","v":0},{"$f":"Journal!C224","v":0},{"$f":"Journal!D224","v":0},13,0,0,0,0]
[null,null,null,{"$f":"Journal!A225","v":0},{"$f":"Journal!B225","v":0},{"$f":"Journal!C225","v":0},{"$f":"Journal!D225","v":0},13,0,0,0,0]
[null,null,null,{"$f":"Journal!A226","v":0},{"$f":"Journal!B226","v":0},{"$f":"Journal!C226","v":0},{"$f":"Journal!D226","v":0},13,0,0,0,0]
[null,null,null,{"$f":"Journal!A227","v":0},{"$f":"Journal!B227","v":0},{"$f":"Journal!C227","v":0},{"$f":"Journal!D227","v":0},13,0,0,0,0]
[null,null,null,{"$f":"Journal!A228","v":0},{"$f":"Journal!B228","v":0},{"$f":"Journal!C228","v":0},{"$f":"Journal!D228","v":0},13,0,0,0,0]
[null,null,null,{"$f":"Journal!A229","v":0},{"$f":"Journal!B229","v":0},{"$f":"Journal!C229","v":0},{"$f":"Journal!D229","v":0},13,0,0,0,0]
[null,null,null,{"$f":"Journal!A230","v":0},{"$f":"Journal!B230","v":0},{"$f":"Journal!C230","v":0},{"$f":"Journal!D230","v":0},13,0,0,0,0]
[null,null,null,{"$f":"Journal!A231","v":0},{"$f":"Journal!B231","v":0},{"$f":"Journal!C231","v":0},{"$f":"Journal!D231","v":0},13,0,0,0,0]
[null,null,null,{"$f":"Journal!A232","v":0},{"$f":"Journal!B232","v":0},{"$f":"Journal!C232","v":0},{"$f":"Journal!D232","v":0},13,0,0,0,0]
[null,null,null,{"$f":"Journal!A233","v":0},{"$f":"Journal!B233","v":0},{"$f":"Journal!C233","v":0},{"$f":"Journal!D233","v":0},13,0,0,0,0]
[null,null,null,{"$f":"Journal!A234","v":0},{"$f":"Journal!B234","v":0},{"$f":"Journal!C234","v":0},{"$f":"Journal!D234","v":0},13,0,0,0,0]
[null,null,null,{"$f":"Journal!A235","v":0},{"$f":"Journal!B235","v":0},{"$f":"Journal!C235","v":0},{"$f":"Journal!D235","v":0},13,0,0,0,0]
[null,null,null,{"$f":"Journal!A236","v":0},{"$f":"Journal!B236","v":0},{"$f":"Journal!C236","v":0},{"$f":"Journal!D236","v":0},13,0,0,0,0]
[null,null,null,{"$f":"Journal!A237","v":0},{"$f":"Journal!B237","v":0},{"$f":"Journal!C237","v":0},{"$f":"Journal!D237","v":0},13,0,0,0,0]
[null,null,null,{"$f":"Journal!A238","v":0},{"$f":"Journal!B238","v":0},{"$f":"Journal!C238","v":0},{"$f":"Journal!D238","v":0},13,0,0,0,0]
[null,null,null,{"$f":"Journal!A239","v":0},{"$f":"Journal!B239","v":0},{"$f":"Journal!C239","v":0},{"$f":"Journal!D239","v":0},13,0,0,0,0]
[null,null,null,{"$f":"Journal!A240","v":0},{"$f":"Journal!B240","v":0},{"$f":"Journal!C240","v":0},{"$f":"Journal!D240","v":0},13,0,0,0,0]
[null,null,null,{"$f":"Journal!A241","v":0},{"$f":"Journal!B241","v":0},{"$f":"Journal!C241","v":0},{"$f":"Journal!D241","v":0},13,0,0,0,0]
[null,null,null,{"$f":"Journal!A242","v":0},{"$f":"Journal!B242","v":0},{"$f":"Journal!C242","v":0},{"$f":"Journal!D242","v":0},13,0,0,0,0]
[null,null,null,{"$f":"Journal!A243","v":0},{"$f":"Journal!B243","v":0},{"$f":"Journal!C243","v":0},{"$f":"Journal!D243","v":0},13,0,0,0,0]
[null,null,null,{"$f":"Journal!A244","v":0},{"$f":"Journal!B244","v":0},{"$f":"Journal!C244","v":0},{"$f":"Journal!D244","v":0},13,0,0,0,0]
[null,null,null,{"$f":"Journal!A245","v":0},{"$f":"Journal!B245","v":0},{"$f":"Journal!C245","v":0},{"$f":"Journal!D245","v":0},13,0,0,0,0]
[null,null,null,{"$f":"Journal!A246","v":0},{"$f":"Journal!B246","v":0},{"$f":"Journal!C246","v":0},{"$f":"Journal!D246","v":0},13,0,0,0,0]
[null,null,null,{"$f":"Journal!A247","v":0},{"$f":"Journal!B247","v":0},{"$f":"Journal!C247","v":0},{"$f":"Journal!D247","v":0},13,0,0,0,0]
[null,null,null,{"$f":"Journal!A248","v":0},{"$f":"Journal!B248","v":0},{"$f":"Journal!C248","v":0},{"$f":"Journal!D248","v":0},13,0,0,0,0]
[null,null,null,{"$f":"Journal!A249","v":0},{"$f":"Journal!B249","v":0},{"$f":"Journal!C249","v":0},{"$f":"Journal!D249","v":0},13,0,0,0,0]
[null,null,null,{"$f":"Journal!A250","v":0},{"$f":"Journal!B250","v":0},{"$f":"Journal!C250","v":0},{"$f":"Journal!D250","v":0},13,0,0,0,0]
[null,null,null,{"$f":"Journal!A251","v":0},{"$f":"Journal!B251","v":0},{"$f":"Journal!C251","v":0},{"$f":"Journal!D251","v":0},13,0,0,0,0]
[null,null,null,{"$f":"Journal!A252","v":0},{"$f":"Journal!B252","v":0},{"$f":"Journal!C252","v":0},{"$f":"Journal!D252","v":0},13,0,0,0,0]
[null,null,null,{"$f":"Journal!A253","v":0},{"$f":"Journal!B253","v":0},{"$f":"Journal!C253","v":0},{"$f":"Journal!D253","v":0},13,0,0,0,0]
[null,null,null,{"$f":"Journal!A254","v":0},{"$f":"Journal!B254","v":0},{"$f":"Journal!C254","v":0},{"$f":"Journal!D254","v":0},13,0,0,0,0]
[null,null,null,{"$f":"Journal!A255","v":0},{"$f":"Journal!B255","v":0},{"$f":"Journal!C255","v":0},{"$f":"Journal!D255","v":0},13,0,0,0,0]
[null,null,null,{"$f":"Journal!A256","v":0},{"$f":"Journal!B256","v":0},{"$f":"Journal!C256","v":0},{"$f":"Journal!D256","v":0},13,0,0,0,0]
[null,null,null,{"$f":"Journal!A257","v":0},{"$f":"Journal!B257","v":0},{"$f":"Journal!C257","v":0},{"$f":"Journal!D257","v":0},13,0,0,0,0]
[null,null,null,{"$f":"Journal!A258","v":0},{"$f":"Journal!B258","v":0},{"$f":"Journal!C258","v":0},{"$f":"Journal!D258","v":0},13,0,0,0,0]
[null,null,null,{"$f":"Journal!A259","v":0},{"$f":"Journal!B259","v":0},{"$f":"Journal!C259","v":0},{"$f":"Journal!D259","v":0},13,0,0,0,0]
[null,null,null,{"$f":"Journal!A260","v":0},{"$f":"Journal!B260","v":0},{"$f":"Journal!C260","v":0},{"$f":"Journal!D260","v":0},13,0,0,0,0]
[null,null,null,{"$f":"Journal!A261","v":0},{"$f":"Journal!B261","v":0},{"$f":"Journal!C261","v":0},{"$f":"Journal!D261","v":0},{"$f":"12-G280+1","v":13},{"$f":"IF(AND(E280=0,F280=0),0,IF(1/F280*2.5>25%,25%,1/F280*2.5))","v":0},{"$f":"E280/5","v":0},{"$f":"IF($E280<410.01,$E280,$E280/$F280/12*$H280)","v":0},{"$f":"IF($E280<410.01,$E280,$E280*I280/1/12*$H280)","v":0}]
[null,null,null,{"$f":"Journal!A262","v":0},{"$f":"Journal!B262","v":0},{"$f":"Journal!C262","v":0},{"$f":"Journal!D262","v":0},13,0,0,0,0]
[null,null,null,{"$f":"Journal!A263","v":0},{"$f":"Journal!B263","v":0},{"$f":"Journal!C263","v":0},{"$f":"Journal!D263","v":0},13,0,0,0,0]
[null,null,null,{"$f":"Journal!A264","v":0},{"$f":"Journal!B264","v":0},{"$f":"Journal!C264","v":0},{"$f":"Journal!D264","v":0},13,0,0,0,0]
[null,null,null,{"$f":"Journal!A265","v":0},{"$f":"Journal!B265","v":0},{"$f":"Journal!C265","v":0},{"$f":"Journal!D265","v":0},13,0,0,0,0]
[null,null,null,{"$f":"Journal!A266","v":0},{"$f":"Journal!B266","v":0},{"$f":"Journal!C266","v":0},{"$f":"Journal!D266","v":0},13,0,0,0,0]
[null,null,null,{"$f":"Journal!A267","v":0},{"$f":"Journal!B267","v":0},{"$f":"Journal!C267","v":0},{"$f":"Journal!D267","v":0},13,0,0,0,0]
[null,null,null,{"$f":"Journal!A268","v":0},{"$f":"Journal!B268","v":0},{"$f":"Journal!C268","v":0},{"$f":"Journal!D268","v":0},13,0,0,0,0]
[null,null,null,{"$f":"Journal!A269","v":0},{"$f":"Journal!B269","v":0},{"$f":"Journal!C269","v":0},{"$f":"Journal!D269","v":0},13,0,0,0,0]
[null,null,null,{"$f":"Journal!A270","v":0},{"$f":"Journal!B270","v":0},{"$f":"Journal!C270","v":0},{"$f":"Journal!D270","v":0},13,0,0,0,0]
[null,null,null,{"$f":"Journal!A271","v":0},{"$f":"Journal!B271","v":0},{"$f":"Journal!C271","v":0},{"$f":"Journal!D271","v":0},13,0,0,0,0]
[null,null,null,{"$f":"Journal!A272","v":0},{"$f":"Journal!B272","v":0},{"$f":"Journal!C272","v":0},{"$f":"Journal!D272","v":0},13,0,0,0,0]
[null,null,null,{"$f":"Journal!A273","v":0},{"$f":"Journal!B273","v":0},{"$f":"Journal!C273","v":0},{"$f":"Journal!D273","v":0},13,0,0,0,0]
[null,null,null,{"$f":"Journal!A274","v":0},{"$f":"Journal!B274","v":0},{"$f":"Journal!C274","v":0},{"$f":"Journal!D274","v":0},13,0,0,0,0]
[null,null,null,{"$f":"Journal!A275","v":0},{"$f":"Journal!B275","v":0},{"$f":"Journal!C275","v":0},{"$f":"Journal!D275","v":0},13,0,0,0,0]
[null,null,null,{"$f":"Journal!A276","v":0},{"$f":"Journal!B276","v":0},{"$f":"Journal!C276","v":0},{"$f":"Journal!D276","v":0},13,0,0,0,0]
[null,null,null,{"$f":"Journal!A277","v":0},{"$f":"Journal!B277","v":0},{"$f":"Journal!C277","v":0},{"$f":"Journal!D277","v":0},13,0,0,0,0]
[null,null,null,{"$f":"Journal!A278","v":0},{"$f":"Journal!B278","v":0},{"$f":"Journal!C278","v":0},{"$f":"Journal!D278","v":0},13,0,0,0,0]
[null,null,null,{"$f":"Journal!A279","v":0},{"$f":"Journal!B279","v":0},{"$f":"Journal!C279","v":0},{"$f":"Journal!D279","v":0},13,0,0,0,0]
[null,null,null,{"$f":"Journal!A280","v":0},{"$f":"Journal!B280","v":0},{"$f":"Journal!C280","v":0},{"$f":"Journal!D280","v":0},13,0,0,0,0]
[null,null,null,{"$f":"Journal!A281","v":0},{"$f":"Journal!B281","v":0},{"$f":"Journal!C281","v":0},{"$f":"Journal!D281","v":0},13,0,0,0,0]
[null,null,null,{"$f":"Journal!A282","v":0},{"$f":"Journal!B282","v":0},{"$f":"Journal!C282","v":0},{"$f":"Journal!D282","v":0},13,0,0,0,0]
[null,null,null,{"$f":"Journal!A283","v":0},{"$f":"Journal!B283","v":0},{"$f":"Journal!C283","v":0},{"$f":"Journal!D283","v":0},13,0,0,0,0]
[null,null,null,{"$f":"Journal!A284","v":0},{"$f":"Journal!B284","v":0},{"$f":"Journal!C284","v":0},{"$f":"Journal!D284","v":0},13,0,0,0,0]
[null,null,null,{"$f":"Journal!A285","v":0},{"$f":"Journal!B285","v":0},{"$f":"Journal!C285","v":0},{"$f":"Journal!D285","v":0},13,0,0,0,0]
[null,null,null,{"$f":"Journal!A286","v":0},{"$f":"Journal!B286","v":0},{"$f":"Journal!C286","v":0},{"$f":"Journal!D286","v":0},13,0,0,0,0]
[null,null,null,{"$f":"Journal!A287","v":0},{"$f":"Journal!B287","v":0},{"$f":"Journal!C287","v":0},{"$f":"Journal!D287","v":0},13,0,0,0,0]
[null,null,null,{"$f":"Journal!A288","v":0},{"$f":"Journal!B288","v":0},{"$f":"Journal!C288","v":0},{"$f":"Journal!D288","v":0},13,0,0,0,0]
[null,null,null,{"$f":"Journal!A289","v":0},{"$f":"Journal!B289","v":0},{"$f":"Journal!C289","v":0},{"$f":"Journal!D289","v":0},13,0,0,0,0]
[null,null,null,{"$f":"Journal!A290","v":0},{"$f":"Journal!B290","v":0},{"$f":"Journal!C290","v":0},{"$f":"Journal!D290","v":0},13,0,0,0,0]
[null,null,null,{"$f":"Journal!A291","v":0},{"$f":"Journal!B291","v":0},{"$f":"Journal!C291","v":0},{"$f":"Journal!D291","v":0},13,0,0,0,0]
[null,null,null,{"$f":"Journal!A292","v":0},{"$f":"Journal!B292","v":0},{"$f":"Journal!C292","v":0},{"$f":"Journal!D292","v":0},13,0,0,0,0]
[null,null,null,{"$f":"Journal!A293","v":0},{"$f":"Journal!B293","v":0},{"$f":"Journal!C293","v":0},{"$f":"Journal!D293","v":0},13,0,0,0,0]
[null,null,null,{"$f":"Journal!A294","v":0},{"$f":"Journal!B294","v":0},{"$f":"Journal!C294","v":0},{"$f":"Journal!D294","v":0},13,0,0,0,0]
[null,null,null,{"$f":"Journal!A295","v":0},{"$f":"Journal!B295","v":0},{"$f":"Journal!C295","v":0},{"$f":"Journal!D295","v":0},13,0,0,0,0]
[null,null,null,{"$f":"Journal!A296","v":0},{"$f":"Journal!B296","v":0},{"$f":"Journal!C296","v":0},{"$f":"Journal!D296","v":0},13,0,0,0,0]
[null,null,null,{"$f":"Journal!A297","v":0},{"$f":"Journal!B297","v":0},{"$f":"Journal!C297","v":0},{"$f":"Journal!D297","v":0},13,0,0,0,0]
[null,null,null,{"$f":"Journal!A298","v":0},{"$f":"Journal!B298","v":0},{"$f":"Journal!C298","v":0},{"$f":"Journal!D298","v":0},13,0,0,0,0]
[null,null,null,{"$f":"Journal!A299","v":0},{"$f":"Journal!B299","v":0},{"$f":"Journal!C299","v":0},{"$f":"Journal!D299","v":0},13,0,0,0,0]
[null,null,null,{"$f":"Journal!A300","v":0},{"$f":"Journal!B300","v":0},{"$f":"Journal!C300","v":0},{"$f":"Journal!D300","v":0},13,0,0,0,0]
[null,null,null,{"$f":"Journal!A301","v":0},{"$f":"Journal!B301","v":0},{"$f":"Journal!C301","v":0},{"$f":"Journal!D301","v":0},13,0,0,0,0]
[null,null,null,{"$f":"Journal!A302","v":0},{"$f":"Journal!B302","v":0},{"$f":"Journal!C302","v":0},{"$f":"Journal!D302","v":0},13,0,0,0,0]
[null,null,null,{"$f":"Journal!A303","v":0},{"$f":"Journal!B303","v":0},{"$f":"Journal!C303","v":0},{"$f":"Journal!D303","v":0},13,0,0,0,0]
[null,null,null,{"$f":"Journal!A304","v":0},{"$f":"Journal!B304","v":0},{"$f":"Journal!C304","v":0},{"$f":"Journal!D304","v":0},13,0,0,0,0]
[null,null,null,{"$f":"Journal!A305","v":0},{"$f":"Journal!B305","v":0},{"$f":"Journal!C305","v":0},{"$f":"Journal!D305","v":0},13,0,0,0,0]
[null,null,null,{"$f":"Journal!A306","v":0},{"$f":"Journal!B306","v":0},{"$f":"Journal!C306","v":0},{"$f":"Journal!D306","v":0},13,0,0,0,0]
[null,null,null,{"$f":"Journal!A307","v":0},{"$f":"Journal!B307","v":0},{"$f":"Journal!C307","v":0},{"$f":"Journal!D307","v":0},13,0,0,0,0]
[null,null,null,{"$f":"Journal!A308","v":0},{"$f":"Journal!B308","v":0},{"$f":"Journal!C308","v":0},{"$f":"Journal!D308","v":0},13,0,0,0,0]
[null,null,null,{"$f":"Journal!A309","v":0},{"$f":"Journal!B309","v":0},{"$f":"Journal!C309","v":0},{"$f":"Journal!D309","v":0},13,0,0,0,0]
[null,null,null,{"$f":"Journal!A310","v":0},{"$f":"Journal!B310","v":0},{"$f":"Journal!C310","v":0},{"$f":"Journal!D310","v":0},13,0,0,0,0]
[null,null,null,{"$f":"Journal!A311","v":0},{"$f":"Journal!B311","v":0},{"$f":"Journal!C311","v":0},{"$f":"Journal!D311","v":0},13,0,0,0,0]
[null,null,null,{"$f":"Journal!A312","v":0},{"$f":"Journal!B312","v":0},{"$f":"Journal!C312","v":0},{"$f":"Journal!D312","v":0},13,0,0,0,0]
[null,null,null,{"$f":"Journal!A313","v":0},{"$f":"Journal!B313","v":0},{"$f":"Journal!C313","v":0},{"$f":"Journal!D313","v":0},13,0,0,0,0]
[null,null,null,{"$f":"Journal!A314","v":0},{"$f":"Journal!B314","v":0},{"$f":"Journal!C314","v":0},{"$f":"Journal!D314","v":0},13,0,0,0,0]
[null,null,null,{"$f":"Journal!A315","v":0},{"$f":"Journal!B315","v":0},{"$f":"Journal!C315","v":0},{"$f":"Journal!D315","v":0},13,0,0,0,0]
[null,null,null,{"$f":"Journal!A316","v":0},{"$f":"Journal!B316","v":0},{"$f":"Journal!C316","v":0},{"$f":"Journal!D316","v":0},13,0,0,0,0]
[null,null,null,{"$f":"Journal!A317","v":0},{"$f":"Journal!B317","v":0},{"$f":"Journal!C317","v":0},{"$f":"Journal!D317","v":0},13,0,0,0,0]
[null,null,null,{"$f":"Journal!A318","v":0},{"$f":"Journal!B318","v":0},{"$f":"Journal!C318","v":0},{"$f":"Journal!D318","v":0},13,0,0,0,0]
[null,null,null,{"$f":"Journal!A319","v":0},{"$f":"Journal!B319","v":0},{"$f":"Journal!C319","v":0},{"$f":"Journal!D319","v":0},13,0,0,0,0]
[null,null,null,{"$f":"Journal!A320","v":0},{"$f":"Journal!B320","v":0},{"$f":"Journal!C320","v":0},{"$f":"Journal!D320","v":0},13,0,0,0,0]
[null,null,null,{"$f":"Journal!A321","v":0},{"$f":"Journal!B321","v":0},{"$f":"Journal!C321","v":0},{"$f":"Journal!D321","v":0},13,0,0,0,0]
[null,null,null,{"$f":"Journal!A322","v":0},{"$f":"Journal!B322","v":0},{"$f":"Journal!C322","v":0},{"$f":"Journal!D322","v":0},13,0,0,0,0]
[null,null,null,{"$f":"Journal!A323","v":0},{"$f":"Journal!B323","v":0},{"$f":"Journal!C323","v":0},{"$f":"Journal!D323","v":0},13,0,0,0,0]
[null,null,null,{"$f":"Journal!A324","v":0},{"$f":"Journal!B324","v":0},{"$f":"Journal!C324","v":0},{"$f":"Journal!D324","v":0},13,0,0,0,0]
[null,null,null,{"$f":"Journal!A325","v":0},{"$f":"Journal!B325","v":0},{"$f":"Journal!C325","v":0},{"$f":"Journal!D325","v":0},{"$f":"12-G344+1","v":13},{"$f":"IF(AND(E344=0,F344=0),0,IF(1/F344*2.5>25%,25%,1/F344*2.5))","v":0},{"$f":"E344/5","v":0},{"$f":"IF($E344<410.01,$E344,$E344/$F344/12*$H344)","v":0},{"$f":"IF($E344<410.01,$E344,$E344*I344/1/12*$H344)","v":0}]
[null,null,null,{"$f":"Journal!A326","v":0},{"$f":"Journal!B326","v":0},{"$f":"Journal!C326","v":0},{"$f":"Journal!D326","v":0},13,0,0,0,0]
[null,null,null,{"$f":"Journal!A327","v":0},{"$f":"Journal!B327","v":0},{"$f":"Journal!C327","v":0},{"$f":"Journal!D327","v":0},13,0,0,0,0]
[null,null,null,{"$f":"Journal!A328","v":0},{"$f":"Journal!B328","v":0},{"$f":"Journal!C328","v":0},{"$f":"Journal!D328","v":0},13,0,0,0,0]
[null,null,null,{"$f":"Journal!A329","v":0},{"$f":"Journal!B329","v":0},{"$f":"Journal!C329","v":0},{"$f":"Journal!D329","v":0},13,0,0,0,0]
[null,null,null,{"$f":"Journal!A330","v":0},{"$f":"Journal!B330","v":0},{"$f":"Journal!C330","v":0},{"$f":"Journal!D330","v":0},13,0,0,0,0]
[null,null,null,{"$f":"Journal!A331","v":0},{"$f":"Journal!B331","v":0},{"$f":"Journal!C331","v":0},{"$f":"Journal!D331","v":0},13,0,0,0,0]
[null,null,null,{"$f":"Journal!A332","v":0},{"$f":"Journal!B332","v":0},{"$f":"Journal!C332","v":0},{"$f":"Journal!D332","v":0},13,0,0,0,0]
[null,null,null,{"$f":"Journal!A333","v":0},{"$f":"Journal!B333","v":0},{"$f":"Journal!C333","v":0},{"$f":"Journal!D333","v":0},13,0,0,0,0]
[null,null,null,{"$f":"Journal!A334","v":0},{"$f":"Journal!B334","v":0},{"$f":"Journal!C334","v":0},{"$f":"Journal!D334","v":0},13,0,0,0,0]
[null,null,null,{"$f":"Journal!A335","v":0},{"$f":"Journal!B335","v":0},{"$f":"Journal!C335","v":0},{"$f":"Journal!D335","v":0},13,0,0,0,0]
[null,null,null,{"$f":"Journal!A336","v":0},{"$f":"Journal!B336","v":0},{"$f":"Journal!C336","v":0},{"$f":"Journal!D336","v":0},13,0,0,0,0]
[null,null,null,{"$f":"Journal!A337","v":0},{"$f":"Journal!B337","v":0},{"$f":"Journal!C337","v":0},{"$f":"Journal!D337","v":0},13,0,0,0,0]
[null,null,null,{"$f":"Journal!A338","v":0},{"$f":"Journal!B338","v":0},{"$f":"Journal!C338","v":0},{"$f":"Journal!D338","v":0},13,0,0,0,0]
[null,null,null,{"$f":"Journal!A339","v":0},{"$f":"Journal!B339","v":0},{"$f":"Journal!C339","v":0},{"$f":"Journal!D339","v":0},13,0,0,0,0]
[null,null,null,{"$f":"Journal!A340","v":0},{"$f":"Journal!B340","v":0},{"$f":"Journal!C340","v":0},{"$f":"Journal!D340","v":0},13,0,0,0,0]
[null,null,null,{"$f":"Journal!A341","v":0},{"$f":"Journal!B341","v":0},{"$f":"Journal!C341","v":0},{"$f":"Journal!D341","v":0},13,0,0,0,0]
[null,null,null,{"$f":"Journal!A342","v":0},{"$f":"Journal!B342","v":0},{"$f":"Journal!C342","v":0},{"$f":"Journal!D342","v":0},13,0,0,0,0]
[null,null,null,{"$f":"Journal!A343","v":0},{"$f":"Journal!B343","v":0},{"$f":"Journal!C343","v":0},{"$f":"Journal!D343","v":0},13,0,0,0,0]
[null,null,null,{"$f":"Journal!A344","v":0},{"$f":"Journal!B344","v":0},{"$f":"Journal!C344","v":0},{"$f":"Journal!D344","v":0},13,0,0,0,0]
[null,null,null,{"$f":"Journal!A345","v":0},{"$f":"Journal!B345","v":0},{"$f":"Journal!C345","v":0},{"$f":"Journal!D345","v":0},13,0,0,0,0]
[null,null,null,{"$f":"Journal!A346","v":0},{"$f":"Journal!B346","v":0},{"$f":"Journal!C346","v":0},{"$f":"Journal!D346","v":0},13,0,0,0,0]
[null,null,null,{"$f":"Journal!A347","v":0},{"$f":"Journal!B347","v":0},{"$f":"Journal!C347","v":0},{"$f":"Journal!D347","v":0},13,0,0,0,0]
[null,null,null,{"$f":"Journal!A348","v":0},{"$f":"Journal!B348","v":0},{"$f":"Journal!C348","v":0},{"$f":"Journal!D348","v":0},13,0,0,0,0]
[null,null,null,{"$f":"Journal!A349","v":0},{"$f":"Journal!B349","v":0},{"$f":"Journal!C349","v":0},{"$f":"Journal!D349","v":0},13,0,0,0,0]
[null,null,null,{"$f":"Journal!A350","v":0},{"$f":"Journal!B350","v":0},{"$f":"Journal!C350","v":0},{"$f":"Journal!D350","v":0},13,0,0,0,0]
[null,null,null,{"$f":"Journal!A351","v":0},{"$f":"Journal!B351","v":0},{"$f":"Journal!C351","v":0},{"$f":"Journal!D351","v":0},13,0,0,0,0]
[null,null,null,{"$f":"Journal!A352","v":0},{"$f":"Journal!B352","v":0},{"$f":"Journal!C352","v":0},{"$f":"Journal!D352","v":0},13,0,0,0,0]
[null,null,null,{"$f":"Journal!A353","v":0},{"$f":"Journal!B353","v":0},{"$f":"Journal!C353","v":0},{"$f":"Journal!D353","v":0},13,0,0,0,0]
[null,null,null,{"$f":"Journal!A354","v":0},{"$f":"Journal!B354","v":0},{"$f":"Journal!C354","v":0},{"$f":"Journal!D354","v":0},13,0,0,0,0]
[null,null,null,{"$f":"Journal!A355","v":0},{"$f":"Journal!B355","v":0},{"$f":"Journal!C355","v":0},{"$f":"Journal!D355","v":0},13,0,0,0,0]
[null,null,null,{"$f":"Journal!A356","v":0},{"$f":"Journal!B356","v":0},{"$f":"Journal!C356","v":0},{"$f":"Journal!D356","v":0},13,0,0,0,0]
[null,null,null,{"$f":"Journal!A357","v":0},{"$f":"Journal!B357","v":0},{"$f":"Journal!C357","v":0},{"$f":"Journal!D357","v":0},13,0,0,0,0]
[null,null,null,{"$f":"Journal!A358","v":0},{"$f":"Journal!B358","v":0},{"$f":"Journal!C358","v":0},{"$f":"Journal!D358","v":0},13,0,0,0,0]
[null,null,null,{"$f":"Journal!A359","v":0},{"$f":"Journal!B359","v":0},{"$f":"Journal!C359","v":0},{"$f":"Journal!D359","v":0},13,0,0,0,0]
[null,null,null,{"$f":"Journal!A360","v":0},{"$f":"Journal!B360","v":0},{"$f":"Journal!C360","v":0},{"$f":"Journal!D360","v":0},13,0,0,0,0]
[null,null,null,{"$f":"Journal!A361","v":0},{"$f":"Journal!B361","v":0},{"$f":"Journal!C361","v":0},{"$f":"Journal!D361","v":0},13,0,0,0,0]
[null,null,null,{"$f":"Journal!A362","v":0},{"$f":"Journal!B362","v":0},{"$f":"Journal!C362","v":0},{"$f":"Journal!D362","v":0},13,0,0,0,0]
[null,null,null,{"$f":"Journal!A363","v":0},{"$f":"Journal!B363","v":0},{"$f":"Journal!C363","v":0},{"$f":"Journal!D363","v":0},13,0,0,0,0]
[null,null,null,{"$f":"Journal!A364","v":0},{"$f":"Journal!B364","v":0},{"$f":"Journal!C364","v":0},{"$f":"Journal!D364","v":0},13,0,0,0,0]
[null,null,null,{"$f":"Journal!A365","v":0},{"$f":"Journal!B365","v":0},{"$f":"Journal!C365","v":0},{"$f":"Journal!D365","v":0},13,0,0,0,0]
[null,null,null,{"$f":"Journal!A366","v":0},{"$f":"Journal!B366","v":0},{"$f":"Journal!C366","v":0},{"$f":"Journal!D366","v":0},13,0,0,0,0]
[null,null,null,{"$f":"Journal!A367","v":0},{"$f":"Journal!B367","v":0},{"$f":"Journal!C367","v":0},{"$f":"Journal!D367","v":0},13,0,0,0,0]
[null,null,null,{"$f":"Journal!A368","v":0},{"$f":"Journal!B368","v":0},{"$f":"Journal!C368","v":0},{"$f":"Journal!D368","v":0},13,0,0,0,0]
[null,null,null,{"$f":"Journal!A369","v":0},{"$f":"Journal!B369","v":0},{"$f":"Journal!C369","v":0},{"$f":"Journal!D369","v":0},13,0,0,0,0]
[null,null,null,{"$f":"Journal!A370","v":0},{"$f":"Journal!B370","v":0},{"$f":"Journal!C370","v":0},{"$f":"Journal!D370","v":0},13,0,0,0,0]
[null,null,null,{"$f":"Journal!A371","v":0},{"$f":"Journal!B371","v":0},{"$f":"Journal!C371","v":0},{"$f":"Journal!D371","v":0},13,0,0,0,0]
[null,null,null,{"$f":"Journal!A372","v":0},{"$f":"Journal!B372","v":0},{"$f":"Journal!C372","v":0},{"$f":"Journal!D372","v":0},13,0,0,0,0]
[null,null,null,{"$f":"Journal!A373","v":0},{"$f":"Journal!B373","v":0},{"$f":"Journal!C373","v":0},{"$f":"Journal!D373","v":0},13,0,0,0,0]
[null,null,null,{"$f":"Journal!A374","v":0},{"$f":"Journal!B374","v":0},{"$f":"Journal!C374","v":0},{"$f":"Journal!D374","v":0},13,0,0,0,0]
[null,null,null,{"$f":"Journal!A375","v":0},{"$f":"Journal!B375","v":0},{"$f":"Journal!C375","v":0},{"$f":"Journal!D375","v":0},13,0,0,0,0]
[null,null,null,{"$f":"Journal!A376","v":0},{"$f":"Journal!B376","v":0},{"$f":"Journal!C376","v":0},{"$f":"Journal!D376","v":0},13,0,0,0,0]
[null,null,null,{"$f":"Journal!A377","v":0},{"$f":"Journal!B377","v":0},{"$f":"Journal!C377","v":0},{"$f":"Journal!D377","v":0},13,0,0,0,0]
[null,null,null,{"$f":"Journal!A378","v":0},{"$f":"Journal!B378","v":0},{"$f":"Journal!C378","v":0},{"$f":"Journal!D378","v":0},13,0,0,0,0]
[null,null,null,{"$f":"Journal!A379","v":0},{"$f":"Journal!B379","v":0},{"$f":"Journal!C379","v":0},{"$f":"Journal!D379","v":0},13,0,0,0,0]
[null,null,null,{"$f":"Journal!A380","v":0},{"$f":"Journal!B380","v":0},{"$f":"Journal!C380","v":0},{"$f":"Journal!D380","v":0},13,0,0,0,0]
[null,null,null,{"$f":"Journal!A381","v":0},{"$f":"Journal!B381","v":0},{"$f":"Journal!C381","v":0},{"$f":"Journal!D381","v":0},13,0,0,0,0]
[null,null,null,{"$f":"Journal!A382","v":0},{"$f":"Journal!B382","v":0},{"$f":"Journal!C382","v":0},{"$f":"Journal!D382","v":0},13,0,0,0,0]
[null,null,null,{"$f":"Journal!A383","v":0},{"$f":"Journal!B383","v":0},{"$f":"Journal!C383","v":0},{"$f":"Journal!D383","v":0},13,0,0,0,0]
[null,null,null,{"$f":"Journal!A384","v":0},{"$f":"Journal!B384","v":0},{"$f":"Journal!C384","v":0},{"$f":"Journal!D384","v":0},13,0,0,0,0]
[null,null,null,{"$f":"Journal!A385","v":0},{"$f":"Journal!B385","v":0},{"$f":"Journal!C385","v":0},{"$f":"Journal!D385","v":0},13,0,0,0,0]
[null,null,null,{"$f":"Journal!A386","v":0},{"$f":"Journal!B386","v":0},{"$f":"Journal!C386","v":0},{"$f":"Journal!D386","v":0},13,0,0,0,0]
[null,null,null,{"$f":"Journal!A387","v":0},{"$f":"Journal!B387","v":0},{"$f":"Journal!C387","v":0},{"$f":"Journal!D387","v":0},13,0,0,0,0]
[null,null,null,{"$f":"Journal!A388","v":0},{"$f":"Journal!B388","v":0},{"$f":"Journal!C388","v":0},{"$f":"Journal!D388","v":0},13,0,0,0,0]
[null,null,null,{"$f":"Journal!A389","v":0},{"$f":"Journal!B389","v":0},{"$f":"Journal!C389","v":0},{"$f":"Journal!D389","v":0},{"$f":"12-G408+1","v":13},{"$f":"IF(AND(E408=0,F408=0),0,IF(1/F408*2.5>25%,25%,1/F408*2.5))","v":0},{"$f":"E408/5","v":0},{"$f":"IF($E408<410.01,$E408,$E408/$F408/12*$H408)","v":0},{"$f":"IF($E408<410.01,$E408,$E408*I408/1/12*$H408)","v":0}]
[null,null,null,{"$f":"Journal!A390","v":0},{"$f":"Journal!B390","v":0},{"$f":"Journal!C390","v":0},{"$f":"Journal!D390","v":0},13,0,0,0,0]
[null,null,null,{"$f":"Journal!A391","v":0},{"$f":"Journal!B391","v":0},{"$f":"Journal!C391","v":0},{"$f":"Journal!D391","v":0},13,0,0,0,0]
[null,null,null,{"$f":"Journal!A392","v":0},{"$f":"Journal!B392","v":0},{"$f":"Journal!C392","v":0},{"$f":"Journal!D392","v":0},13,0,0,0,0]
[null,null,null,{"$f":"Journal!A393","v":0},{"$f":"Journal!B393","v":0},{"$f":"Journal!C393","v":0},{"$f":"Journal!D393","v":0},13,0,0,0,0]
[null,null,null,{"$f":"Journal!A394","v":0},{"$f":"Journal!B394","v":0},{"$f":"Journal!C394","v":0},{"$f":"Journal!D394","v":0},13,0,0,0,0]
[null,null,null,{"$f":"Journal!A395","v":0},{"$f":"Journal!B395","v":0},{"$f":"Journal!C395","v":0},{"$f":"Journal!D395","v":0},13,0,0,0,0]
[null,null,null,{"$f":"Journal!A396","v":0},{"$f":"Journal!B396","v":0},{"$f":"Journal!C396","v":0},{"$f":"Journal!D396","v":0},13,0,0,0,0]
[null,null,null,{"$f":"Journal!A397","v":0},{"$f":"Journal!B397","v":0},{"$f":"Journal!C397","v":0},{"$f":"Journal!D397","v":0},13,0,0,0,0]
[null,null,null,{"$f":"Journal!A398","v":0},{"$f":"Journal!B398","v":0},{"$f":"Journal!C398","v":0},{"$f":"Journal!D398","v":0},13,0,0,0,0]
[null,null,null,{"$f":"Journal!A399","v":0},{"$f":"Journal!B399","v":0},{"$f":"Journal!C399","v":0},{"$f":"Journal!D399","v":0},13,0,0,0,0]
[null,null,null,{"$f":"Journal!A400","v":0},{"$f":"Journal!B400","v":0},{"$f":"Journal!C400","v":0},{"$f":"Journal!D400","v":0},13,0,0,0,0]
[null,null,null,{"$f":"Journal!A401","v":0},{"$f":"Journal!B401","v":0},{"$f":"Journal!C401","v":0},{"$f":"Journal!D401","v":0},13,0,0,0,0]
[null,null,null,{"$f":"Journal!A402","v":0},{"$f":"Journal!B402","v":0},{"$f":"Journal!C402","v":0},{"$f":"Journal!D402","v":0},13,0,0,0,0]
[null,null,null,{"$f":"Journal!A403","v":0},{"$f":"Journal!B403","v":0},{"$f":"Journal!C403","v":0},{"$f":"Journal!D403","v":0},13,0,0,0,0]
[null,null,null,{"$f":"Journal!A404","v":0},{"$f":"Journal!B404","v":0},{"$f":"Journal!C404","v":0},{"$f":"Journal!D404","v":0},13,0,0,0,0]
[null,null,null,{"$f":"Journal!A405","v":0},{"$f":"Journal!B405","v":0},{"$f":"Journal!C405","v":0},{"$f":"Journal!D405","v":0},13,0,0,0,0]
[null,null,null,{"$f":"Journal!A406","v":0},{"$f":"Journal!B406","v":0},{"$f":"Journal!C406","v":0},{"$f":"Journal!D406","v":0},13,0,0,0,0]
[null,null,null,{"$f":"Journal!A407","v":0},{"$f":"Journal!B407","v":0},{"$f":"Journal!C407","v":0},{"$f":"Journal!D407","v":0},13,0,0,0,0]
[null,null,null,{"$f":"Journal!A408","v":0},{"$f":"Journal!B408","v":0},{"$f":"Journal!C408","v":0},{"$f":"Journal!D408","v":0},13,0,0,0,0]
[null,null,null,{"$f":"Journal!A409","v":0},{"$f":"Journal!B409","v":0},{"$f":"Journal!C409","v":0},{"$f":"Journal!D409","v":0},13,0,0,0,0]
[null,null,null,{"$f":"Journal!A410","v":0},{"$f":"Journal!B410","v":0},{"$f":"Journal!C410","v":0},{"$f":"Journal!D410","v":0},13,0,0,0,0]
[null,null,null,{"$f":"Journal!A411","v":0},{"$f":"Journal!B411","v":0},{"$f":"Journal!C411","v":0},{"$f":"Journal!D411","v":0},13,0,0,0,0]
[null,null,null,{"$f":"Journal!A412","v":0},{"$f":"Journal!B412","v":0},{"$f":"Journal!C412","v":0},{"$f":"Journal!D412","v":0},13,0,0,0,0]
[null,null,null,{"$f":"Journal!A413","v":0},{"$f":"Journal!B413","v":0},{"$f":"Journal!C413","v":0},{"$f":"Journal!D413","v":0},13,0,0,0,0]
[null,null,null,{"$f":"Journal!A414","v":0},{"$f":"Journal!B414","v":0},{"$f":"Journal!C414","v":0},{"$f":"Journal!D414","v":0},13,0,0,0,0]
[null,null,null,{"$f":"Journal!A415","v":0},{"$f":"Journal!B415","v":0},{"$f":"Journal!C415","v":0},{"$f":"Journal!D415","v":0},13,0,0,0,0]
[null,null,null,{"$f":"Journal!A416","v":0},{"$f":"Journal!B416","v":0},{"$f":"Journal!C416","v":0},{"$f":"Journal!D416","v":0},13,0,0,0,0]
[null,null,null,{"$f":"Journal!A417","v":0},{"$f":"Journal!B417","v":0},{"$f":"Journal!C417","v":0},{"$f":"Journal!D417","v":0},13,0,0,0,0]
[null,null,null,{"$f":"Journal!A418","v":0},{"$f":"Journal!B418","v":0},{"$f":"Journal!C418","v":0},{"$f":"Journal!D418","v":0},13,0,0,0,0]
[null,null,null,{"$f":"Journal!A419","v":0},{"$f":"Journal!B419","v":0},{"$f":"Journal!C419","v":0},{"$f":"Journal!D419","v":0},13,0,0,0,0]
[null,null,null,{"$f":"Journal!A420","v":0},{"$f":"Journal!B420","v":0},{"$f":"Journal!C420","v":0},{"$f":"Journal!D420","v":0},13,0,0,0,0]
[null,null,null,{"$f":"Journal!A421","v":0},{"$f":"Journal!B421","v":0},{"$f":"Journal!C421","v":0},{"$f":"Journal!D421","v":0},13,0,0,0,0]
[null,null,null,{"$f":"Journal!A422","v":0},{"$f":"Journal!B422","v":0},{"$f":"Journal!C422","v":0},{"$f":"Journal!D422","v":0},13,0,0,0,0]
[null,null,null,{"$f":"Journal!A423","v":0},{"$f":"Journal!B423","v":0},{"$f":"Journal!C423","v":0},{"$f":"Journal!D423","v":0},13,0,0,0,0]
[null,null,null,{"$f":"Journal!A424","v":0},{"$f":"Journal!B424","v":0},{"$f":"Journal!C424","v":0},{"$f":"Journal!D424","v":0},13,0,0,0,0]
[null,null,null,{"$f":"Journal!A425","v":0},{"$f":"Journal!B425","v":0},{"$f":"Journal!C425","v":0},{"$f":"Journal!D425","v":0},13,0,0,0,0]
[null,null,null,{"$f":"Journal!A426","v":0},{"$f":"Journal!B426","v":0},{"$f":"Journal!C426","v":0},{"$f":"Journal!D426","v":0},13,0,0,0,0]
[null,null,null,{"$f":"Journal!A427","v":0},{"$f":"Journal!B427","v":0},{"$f":"Journal!C427","v":0},{"$f":"Journal!D427","v":0},13,0,0,0,0]
[null,null,null,{"$f":"Journal!A428","v":0},{"$f":"Journal!B428","v":0},{"$f":"Journal!C428","v":0},{"$f":"Journal!D428","v":0},13,0,0,0,0]
[null,null,null,{"$f":"Journal!A429","v":0},{"$f":"Journal!B429","v":0},{"$f":"Journal!C429","v":0},{"$f":"Journal!D429","v":0},13,0,0,0,0]
[null,null,null,{"$f":"Journal!A430","v":0},{"$f":"Journal!B430","v":0},{"$f":"Journal!C430","v":0},{"$f":"Journal!D430","v":0},13,0,0,0,0]
[null,null,null,{"$f":"Journal!A431","v":0},{"$f":"Journal!B431","v":0},{"$f":"Journal!C431","v":0},{"$f":"Journal!D431","v":0},13,0,0,0,0]
[null,null,null,{"$f":"Journal!A432","v":0},{"$f":"Journal!B432","v":0},{"$f":"Journal!C432","v":0},{"$f":"Journal!D432","v":0},13,0,0,0,0]
[null,null,null,{"$f":"Journal!A433","v":0},{"$f":"Journal!B433","v":0},{"$f":"Journal!C433","v":0},{"$f":"Journal!D433","v":0},13,0,0,0,0]
[null,null,null,{"$f":"Journal!A434","v":0},{"$f":"Journal!B434","v":0},{"$f":"Journal!C434","v":0},{"$f":"Journal!D434","v":0},13,0,0,0,0]
[null,null,null,{"$f":"Journal!A435","v":0},{"$f":"Journal!B435","v":0},{"$f":"Journal!C435","v":0},{"$f":"Journal!D435","v":0},13,0,0,0,0]
[null,null,null,{"$f":"Journal!A436","v":0},{"$f":"Journal!B436","v":0},{"$f":"Journal!C436","v":0},{"$f":"Journal!D436","v":0},13,0,0,0,0]
[null,null,null,{"$f":"Journal!A437","v":0},{"$f":"Journal!B437","v":0},{"$f":"Journal!C437","v":0},{"$f":"Journal!D437","v":0},13,0,0,0,0]
[null,null,null,{"$f":"Journal!A438","v":0},{"$f":"Journal!B438","v":0},{"$f":"Journal!C438","v":0},{"$f":"Journal!D438","v":0},13,0,0,0,0]
[null,null,null,{"$f":"Journal!A439","v":0},{"$f":"Journal!B439","v":0},{"$f":"Journal!C439","v":0},{"$f":"Journal!D439","v":0},13,0,0,0,0]
[null,null,null,{"$f":"Journal!A440","v":0},{"$f":"Journal!B440","v":0},{"$f":"Journal!C440","v":0},{"$f":"Journal!D440","v":0},13,0,0,0,0]
[null,null,null,{"$f":"Journal!A441","v":0},{"$f":"Journal!B441","v":0},{"$f":"Journal!C441","v":0},{"$f":"Journal!D441","v":0},13,0,0,0,0]
[null,null,null,{"$f":"Journal!A442","v":0},{"$f":"Journal!B442","v":0},{"$f":"Journal!C442","v":0},{"$f":"Journal!D442","v":0},13,0,0,0,0]
[null,null,null,{"$f":"Journal!A443","v":0},{"$f":"Journal!B443","v":0},{"$f":"Journal!C443","v":0},{"$f":"Journal!D443","v":0},13,0,0,0,0]
[null,null,null,{"$f":"Journal!A444","v":0},{"$f":"Journal!B444","v":0},{"$f":"Journal!C444","v":0},{"$f":"Journal!D444","v":0},13,0,0,0,0]
[null,null,null,{"$f":"Journal!A445","v":0},{"$f":"Journal!B445","v":0},{"$f":"Journal!C445","v":0},{"$f":"Journal!D445","v":0},13,0,0,0,0]
[null,null,null,{"$f":"Journal!A446","v":0},{"$f":"Journal!B446","v":0},{"$f":"Journal!C446","v":0},{"$f":"Journal!D446","v":0},13,0,0,0,0]
[null,null,null,{"$f":"Journal!A447","v":0},{"$f":"Journal!B447","v":0},{"$f":"Journal!C447","v":0},{"$f":"Journal!D447","v":0},13,0,0,0,0]
[null,null,null,{"$f":"Journal!A448","v":0},{"$f":"Journal!B448","v":0},{"$f":"Journal!C448","v":0},{"$f":"Journal!D448","v":0},13,0,0,0,0]
[null,null,null,{"$f":"Journal!A449","v":0},{"$f":"Journal!B449","v":0},{"$f":"Journal!C449","v":0},{"$f":"Journal!D449","v":0},13,0,0,0,0]
[null,null,null,{"$f":"Journal!A450","v":0},{"$f":"Journal!B450","v":0},{"$f":"Journal!C450","v":0},{"$f":"Journal!D450","v":0},13,0,0,0,0]
[null,null,null,{"$f":"Journal!A451","v":0},{"$f":"Journal!B451","v":0},{"$f":"Journal!C451","v":0},{"$f":"Journal!D451","v":0},13,0,0,0,0]
[null,null,null,{"$f":"Journal!A452","v":0},{"$f":"Journal!B452","v":0},{"$f":"Journal!C452","v":0},{"$f":"Journal!D452","v":0},13,0,0,0,0]
[null,null,null,{"$f":"Journal!A453","v":0},{"$f":"Journal!B453","v":0},{"$f":"Journal!C453","v":0},{"$f":"Journal!D453","v":0},{"$f":"12-G472+1","v":13},{"$f":"IF(AND(E472=0,F472=0),0,IF(1/F472*2.5>25%,25%,1/F472*2.5))","v":0},{"$f":"E472/5","v":0},{"$f":"IF($E472<410.01,$E472,$E472/$F472/12*$H472)","v":0},{"$f":"IF($E472<410.01,$E472,$E472*I472/1/12*$H472)","v":0}]
[null,null,null,{"$f":"Journal!A454","v":0},{"$f":"Journal!B454","v":0},{"$f":"Journal!C454","v":0},{"$f":"Journal!D454","v":0},13,0,0,0,0]
[null,null,null,{"$f":"Journal!A455","v":0},{"$f":"Journal!B455","v":0},{"$f":"Journal!C455","v":0},{"$f":"Journal!D455","v":0},13,0,0,0,0]
[null,null,null,{"$f":"Journal!A456","v":0},{"$f":"Journal!B456","v":0},{"$f":"Journal!C456","v":0},{"$f":"Journal!D456","v":0},13,0,0,0,0]
[null,null,null,{"$f":"Journal!A457","v":0},{"$f":"Journal!B457","v":0},{"$f":"Journal!C457","v":0},{"$f":"Journal!D457","v":0},13,0,0,0,0]
[null,null,null,{"$f":"Journal!A458","v":0},{"$f":"Journal!B458","v":0},{"$f":"Journal!C458","v":0},{"$f":"Journal!D458","v":0},13,0,0,0,0]
[null,null,null,{"$f":"Journal!A459","v":0},{"$f":"Journal!B459","v":0},{"$f":"Journal!C459","v":0},{"$f":"Journal!D459","v":0},13,0,0,0,0]
[null,null,null,{"$f":"Journal!A460","v":0},{"$f":"Journal!B460","v":0},{"$f":"Journal!C460","v":0},{"$f":"Journal!D460","v":0},13,0,0,0,0]
[null,null,null,{"$f":"Journal!A461","v":0},{"$f":"Journal!B461","v":0},{"$f":"Journal!C461","v":0},{"$f":"Journal!D461","v":0},13,0,0,0,0]
[null,null,null,{"$f":"Journal!A462","v":0},{"$f":"Journal!B462","v":0},{"$f":"Journal!C462","v":0},{"$f":"Journal!D462","v":0},13,0,0,0,0]
[null,null,null,{"$f":"Journal!A463","v":0},{"$f":"Journal!B463","v":0},{"$f":"Journal!C463","v":0},{"$f":"Journal!D463","v":0},13,0,0,0,0]
[null,null,null,{"$f":"Journal!A464","v":0},{"$f":"Journal!B464","v":0},{"$f":"Journal!C464","v":0},{"$f":"Journal!D464","v":0},13,0,0,0,0]
[null,null,null,{"$f":"Journal!A465","v":0},{"$f":"Journal!B465","v":0},{"$f":"Journal!C465","v":0},{"$f":"Journal!D465","v":0},13,0,0,0,0]
[null,null,null,{"$f":"Journal!A466","v":0},{"$f":"Journal!B466","v":0},{"$f":"Journal!C466","v":0},{"$f":"Journal!D466","v":0},13,0,0,0,0]
[null,null,null,{"$f":"Journal!A467","v":0},{"$f":"Journal!B467","v":0},{"$f":"Journal!C467","v":0},{"$f":"Journal!D467","v":0},13,0,0,0,0]
[null,null,null,{"$f":"Journal!A468","v":0},{"$f":"Journal!B468","v":0},{"$f":"Journal!C468","v":0},{"$f":"Journal!D468","v":0},13,0,0,0,0]
[null,null,null,{"$f":"Journal!A469","v":0},{"$f":"Journal!B469","v":0},{"$f":"Journal!C469","v":0},{"$f":"Journal!D469","v":0},13,0,0,0,0]
[null,null,null,{"$f":"Journal!A470","v":0},{"$f":"Journal!B470","v":0},{"$f":"Journal!C470","v":0},{"$f":"Journal!D470","v":0},13,0,0,0,0]
[null,null,null,{"$f":"Journal!A471","v":0},{"$f":"Journal!B471","v":0},{"$f":"Journal!C471","v":0},{"$f":"Journal!D471","v":0},13,0,0,0,0]
[null,null,null,{"$f":"Journal!A472","v":0},{"$f":"Journal!B472","v":0},{"$f":"Journal!C472","v":0},{"$f":"Journal!D472","v":0},13,0,0,0,0]
[null,null,null,{"$f":"Journal!A473","v":0},{"$f":"Journal!B473","v":0},{"$f":"Journal!C473","v":0},{"$f":"Journal!D473","v":0},13,0,0,0,0]
[null,null,null,{"$f":"Journal!A474","v":0},{"$f":"Journal!B474","v":0},{"$f":"Journal!C474","v":0},{"$f":"Journal!D474","v":0},13,0,0,0,0]
[null,null,null,{"$f":"Journal!A475","v":0},{"$f":"Journal!B475","v":0},{"$f":"Journal!C475","v":0},{"$f":"Journal!D475","v":0},13,0,0,0,0]
[null,null,null,{"$f":"Journal!A476","v":0},{"$f":"Journal!B476","v":0},{"$f":"Journal!C476","v":0},{"$f":"Journal!D476","v":0},13,0,0,0,0]
[null,null,null,{"$f":"Journal!A477","v":0},{"$f":"Journal!B477","v":0},{"$f":"Journal!C477","v":0},{"$f":"Journal!D477","v":0},13,0,0,0,0]
[null,null,null,{"$f":"Journal!A478","v":0},{"$f":"Journal!B478","v":0},{"$f":"Journal!C478","v":0},{"$f":"Journal!D478","v":0},13,0,0,0,0]
[null,null,null,{"$f":"Journal!A479","v":0},{"$f":"Journal!B479","v":0},{"$f":"Journal!C479","v":0},{"$f":"Journal!D479","v":0},13,0,0,0,0]
[null,null,null,{"$f":"Journal!A480","v":0},{"$f":"Journal!B480","v":0},{"$f":"Journal!C480","v":0},{"$f":"Journal!D480","v":0},13,0,0,0,0]
[null,null,null,{"$f":"Journal!A481","v":0},{"$f":"Journal!B481","v":0},{"$f":"Journal!C481","v":0},{"$f":"Journal!D481","v":0},13,0,0,0,0]
[null,null,null,{"$f":"Journal!A482","v":0},{"$f":"Journal!B482","v":0},{"$f":"Journal!C482","v":0},{"$f":"Journal!D482","v":0},13,0,0,0,0]
[null,null,null,{"$f":"Journal!A483","v":0},{"$f":"Journal!B483","v":0},{"$f":"Journal!C483","v":0},{"$f":"Journal!D483","v":0},13,0,0,0,0]
[null,null,null,{"$f":"Journal!A484","v":0},{"$f":"Journal!B484","v":0},{"$f":"Journal!C484","v":0},{"$f":"Journal!D484","v":0},13,0,0,0,0]
[null,null,null,{"$f":"Journal!A485","v":0},{"$f":"Journal!B485","v":0},{"$f":"Journal!C485","v":0},{"$f":"Journal!D485","v":0},13,0,0,0,0]
[null,null,null,{"$f":"Journal!A486","v":0},{"$f":"Journal!B486","v":0},{"$f":"Journal!C486","v":0},{"$f":"Journal!D486","v":0},13,0,0,0,0]
[null,null,null,{"$f":"Journal!A487","v":0},{"$f":"Journal!B487","v":0},{"$f":"Journal!C487","v":0},{"$f":"Journal!D487","v":0},13,0,0,0,0]
[null,null,null,{"$f":"Journal!A488","v":0},{"$f":"Journal!B488","v":0},{"$f":"Journal!C488","v":0},{"$f":"Journal!D488","v":0},13,0,0,0,0]
[null,null,null,{"$f":"Journal!A489","v":0},{"$f":"Journal!B489","v":0},{"$f":"Journal!C489","v":0},{"$f":"Journal!D489","v":0},13,0,0,0,0]
[null,null,null,{"$f":"Journal!A490","v":0},{"$f":"Journal!B490","v":0},{"$f":"Journal!C490","v":0},{"$f":"Journal!D490","v":0},13,0,0,0,0]
[null,null,null,{"$f":"Journal!A491","v":0},{"$f":"Journal!B491","v":0},{"$f":"Journal!C491","v":0},{"$f":"Journal!D491","v":0},13,0,0,0,0]
[null,null,null,{"$f":"Journal!A492","v":0},{"$f":"Journal!B492","v":0},{"$f":"Journal!C492","v":0},{"$f":"Journal!D492","v":0},13,0,0,0,0]
[null,null,null,{"$f":"Journal!A493","v":0},{"$f":"Journal!B493","v":0},{"$f":"Journal!C493","v":0},{"$f":"Journal!D493","v":0},13,0,0,0,0]
[null,null,null,{"$f":"Journal!A494","v":0},{"$f":"Journal!B494","v":0},{"$f":"Journal!C494","v":0},{"$f":"Journal!D494","v":0},13,0,0,0,0]
[null,null,null,{"$f":"Journal!A495","v":0},{"$f":"Journal!B495","v":0},{"$f":"Journal!C495","v":0},{"$f":"Journal!D495","v":0},13,0,0,0,0]
[null,null,null,{"$f":"Journal!A496","v":0},{"$f":"Journal!B496","v":0},{"$f":"Journal!C496","v":0},{"$f":"Journal!D496","v":0},13,0,0,0,0]
[null,null,null,{"$f":"Journal!A497","v":0},{"$f":"Journal!B497","v":0},{"$f":"Journal!C497","v":0},{"$f":"Journal!D497","v":0},13,0,0,0,0]
[null,null,null,{"$f":"Journal!A498","v":0},{"$f":"Journal!B498","v":0},{"$f":"Journal!C498","v":0},{"$f":"Journal!D498","v":0},13,0,0,0,0]
[null,null,null,{"$f":"Journal!A499","v":0},{"$f":"Journal!B499","v":0},{"$f":"Journal!C499","v":0},{"$f":"Journal!D499","v":0},13,0,0,0,0]
[null,null,null,{"$f":"Journal!A500","v":0},{"$f":"Journal!B500","v":0},{"$f":"Journal!C500","v":0},{"$f":"Journal!D500","v":0},13,0,0,0,0]
[null,null,null,{"$f":"Journal!A501","v":0},{"$f":"Journal!B501","v":0},{"$f":"Journal!C501","v":0},{"$f":"Journal!D501","v":0},13,0,0,0,0]
[null,null,null,{"$f":"Journal!A502","v":0},{"$f":"Journal!B502","v":0},{"$f":"Journal!C502","v":0},{"$f":"Journal!D502","v":0},13,0,0,0,0]
[null,null,null,{"$f":"Journal!A503","v":0},{"$f":"Journal!B503","v":0},{"$f":"Journal!C503","v":0},{"$f":"Journal!D503","v":0},13,0,0,0,0]
[null,null,null,{"$f":"Journal!A504","v":0},{"$f":"Journal!B504","v":0},{"$f":"Journal!C504","v":0},{"$f":"Journal!D504","v":0},13,0,0,0,0]
[null,null,null,{"$f":"Journal!A505","v":0},{"$f":"Journal!B505","v":0},{"$f":"Journal!C505","v":0},{"$f":"Journal!D505","v":0},13,0,0,0,0]
[null,null,null,{"$f":"Journal!A506","v":0},{"$f":"Journal!B506","v":0},{"$f":"Journal!C506","v":0},{"$f":"Journal!D506","v":0},13,0,0,0,0]
[null,null,null,{"$f":"Journal!A507","v":0},{"$f":"Journal!B507","v":0},{"$f":"Journal!C507","v":0},{"$f":"Journal!D507","v":0},13,0,0,0,0]
[null,null,null,{"$f":"Journal!A508","v":0},{"$f":"Journal!B508","v":0},{"$f":"Journal!C508","v":0},{"$f":"Journal!D508","v":0},13,0,0,0,0]
[null,null,null,{"$f":"Journal!A509","v":0},{"$f":"Journal!B509","v":0},{"$f":"Journal!C509","v":0},{"$f":"Journal!D509","v":0},13,0,0,0,0]
[null,null,null,{"$f":"Journal!A510","v":0},{"$f":"Journal!B510","v":0},{"$f":"Journal!C510","v":0},{"$f":"Journal!D510","v":0},13,0,0,0,0]
[null,null,null,{"$f":"Journal!A511","v":0},{"$f":"Journal!B511","v":0},{"$f":"Journal!C511","v":0},{"$f":"Journal!D511","v":0},13,0,0,0,0]
[null,null,null,{"$f":"Journal!A512","v":0},{"$f":"Journal!B512","v":0},{"$f":"Journal!C512","v":0},{"$f":"Journal!D512","v":0},13,0,0,0,0]
[null,null,null,{"$f":"Journal!A513","v":0},{"$f":"Journal!B513","v":0},{"$f":"Journal!C513","v":0},{"$f":"Journal!D513","v":0},13,0,0,0,0]
[null,null,null,{"$f":"Journal!A514","v":0},{"$f":"Journal!B514","v":0},{"$f":"Journal!C514","v":0},{"$f":"Journal!D514","v":0},13,0,0,0,0]
[null,null,null,{"$f":"Journal!A515","v":0},{"$f":"Journal!B515","v":0},{"$f":"Journal!C515","v":0},{"$f":"Journal!D515","v":0},13,0,0,0,0]
[null,null,null,{"$f":"Journal!A516","v":0},{"$f":"Journal!B516","v":0},{"$f":"Journal!C516","v":0},{"$f":"Journal!D516","v":0},13,0,0,0,0]
[null,null,null,{"$f":"Journal!A517","v":0},{"$f":"Journal!B517","v":0},{"$f":"Journal!C517","v":0},{"$f":"Journal!D517","v":0},{"$f":"12-G536+1","v":13},{"$f":"IF(AND(E536=0,F536=0),0,IF(1/F536*2.5>25%,25%,1/F536*2.5))","v":0},{"$f":"E536/5","v":0},{"$f":"IF($E536<410.01,$E536,$E536/$F536/12*$H536)","v":0},{"$f":"IF($E536<410.01,$E536,$E536*I536/1/12*$H536)","v":0}]
[null,null,null,{"$f":"Journal!A518","v":0},{"$f":"Journal!B518","v":0},{"$f":"Journal!C518","v":0},{"$f":"Journal!D518","v":0},13,0,0,0,0]
[null,null,null,{"$f":"Journal!A519","v":0},{"$f":"Journal!B519","v":0},{"$f":"Journal!C519","v":0},{"$f":"Journal!D519","v":0},13,0,0,0,0]
[null,null,null,{"$f":"Journal!A520","v":0},{"$f":"Journal!B520","v":0},{"$f":"Journal!C520","v":0},{"$f":"Journal!D520","v":0},13,0,0,0,0]
[null,null,null,{"$f":"Journal!A521","v":0},{"$f":"Journal!B521","v":0},{"$f":"Journal!C521","v":0},{"$f":"Journal!D521","v":0},13,0,0,0,0]
[null,null,null,{"$f":"Journal!A522","v":0},{"$f":"Journal!B522","v":0},{"$f":"Journal!C522","v":0},{"$f":"Journal!D522","v":0},13,0,0,0,0]
[null,null,null,{"$f":"Journal!A523","v":0},{"$f":"Journal!B523","v":0},{"$f":"Journal!C523","v":0},{"$f":"Journal!D523","v":0},13,0,0,0,0]
[null,null,null,{"$f":"Journal!A524","v":0},{"$f":"Journal!B524","v":0},{"$f":"Journal!C524","v":0},{"$f":"Journal!D524","v":0},13,0,0,0,0]
[null,null,null,{"$f":"Journal!A525","v":0},{"$f":"Journal!B525","v":0},{"$f":"Journal!C525","v":0},{"$f":"Journal!D525","v":0},13,0,0,0,0]
[null,null,null,{"$f":"Journal!A526","v":0},{"$f":"Journal!B526","v":0},{"$f":"Journal!C526","v":0},{"$f":"Journal!D526","v":0},13,0,0,0,0]
[null,null,null,{"$f":"Journal!A527","v":0},{"$f":"Journal!B527","v":0},{"$f":"Journal!C527","v":0},{"$f":"Journal!D527","v":0},13,0,0,0,0]
[null,null,null,{"$f":"Journal!A528","v":0},{"$f":"Journal!B528","v":0},{"$f":"Journal!C528","v":0},{"$f":"Journal!D528","v":0},13,0,0,0,0]
[null,null,null,{"$f":"Journal!A529","v":0},{"$f":"Journal!B529","v":0},{"$f":"Journal!C529","v":0},{"$f":"Journal!D529","v":0},13,0,0,0,0]
[null,null,null,{"$f":"Journal!A530","v":0},{"$f":"Journal!B530","v":0},{"$f":"Journal!C530","v":0},{"$f":"Journal!D530","v":0},13,0,0,0,0]
[null,null,null,{"$f":"Journal!A531","v":0},{"$f":"Journal!B531","v":0},{"$f":"Journal!C531","v":0},{"$f":"Journal!D531","v":0},13,0,0,0,0]
[null,null,null,{"$f":"Journal!A532","v":0},{"$f":"Journal!B532","v":0},{"$f":"Journal!C532","v":0},{"$f":"Journal!D532","v":0},13,0,0,0,0]
[null,null,null,{"$f":"Journal!A533","v":0},{"$f":"Journal!B533","v":0},{"$f":"Journal!C533","v":0},{"$f":"Journal!D533","v":0},13,0,0,0,0]
[null,null,null,{"$f":"Journal!A534","v":0},{"$f":"Journal!B534","v":0},{"$f":"Journal!C534","v":0},{"$f":"Journal!D534","v":0},13,0,0,0,0]
[null,null,null,{"$f":"Journal!A535","v":0},{"$f":"Journal!B535","v":0},{"$f":"Journal!C535","v":0},{"$f":"Journal!D535","v":0},13,0,0,0,0]
[null,null,null,{"$f":"Journal!A536","v":0},{"$f":"Journal!B536","v":0},{"$f":"Journal!C536","v":0},{"$f":"Journal!D536","v":0},13,0,0,0,0]
[null,null,null,{"$f":"Journal!A537","v":0},{"$f":"Journal!B537","v":0},{"$f":"Journal!C537","v":0},{"$f":"Journal!D537","v":0},13,0,0,0,0]
[null,null,null,{"$f":"Journal!A538","v":0},{"$f":"Journal!B538","v":0},{"$f":"Journal!C538","v":0},{"$f":"Journal!D538","v":0},13,0,0,0,0]
[null,null,null,{"$f":"Journal!A539","v":0},{"$f":"Journal!B539","v":0},{"$f":"Journal!C539","v":0},{"$f":"Journal!D539","v":0},13,0,0,0,0]
[null,null,null,{"$f":"Journal!A540","v":0},{"$f":"Journal!B540","v":0},{"$f":"Journal!C540","v":0},{"$f":"Journal!D540","v":0},13,0,0,0,0]
[null,null,null,{"$f":"Journal!A541","v":0},{"$f":"Journal!B541","v":0},{"$f":"Journal!C541","v":0},{"$f":"Journal!D541","v":0},13,0,0,0,0]
[null,null,null,{"$f":"Journal!A542","v":0},{"$f":"Journal!B542","v":0},{"$f":"Journal!C542","v":0},{"$f":"Journal!D542","v":0},13,0,0,0,0]
[null,null,null,{"$f":"Journal!A543","v":0},{"$f":"Journal!B543","v":0},{"$f":"Journal!C543","v":0},{"$f":"Journal!D543","v":0},13,0,0,0,0]
[null,null,null,{"$f":"Journal!A544","v":0},{"$f":"Journal!B544","v":0},{"$f":"Journal!C544","v":0},{"$f":"Journal!D544","v":0},13,0,0,0,0]
[null,null,null,{"$f":"Journal!A545","v":0},{"$f":"Journal!B545","v":0},{"$f":"Journal!C545","v":0},{"$f":"Journal!D545","v":0},13,0,0,0,0]
[null,null,null,{"$f":"Journal!A546","v":0},{"$f":"Journal!B546","v":0},{"$f":"Journal!C546","v":0},{"$f":"Journal!D546","v":0},13,0,0,0,0]
[null,null,null,{"$f":"Journal!A547","v":0},{"$f":"Journal!B547","v":0},{"$f":"Journal!C547","v":0},{"$f":"Journal!D547","v":0},13,0,0,0,0]
[null,null,null,{"$f":"Journal!A548","v":0},{"$f":"Journal!B548","v":0},{"$f":"Journal!C548","v":0},{"$f":"Journal!D548","v":0},13,0,0,0,0]
[null,null,null,{"$f":"Journal!A549","v":0},{"$f":"Journal!B549","v":0},{"$f":"Journal!C549","v":0},{"$f":"Journal!D549","v":0},13,0,0,0,0]
[null,null,null,{"$f":"Journal!A550","v":0},{"$f":"Journal!B550","v":0},{"$f":"Journal!C550","v":0},{"$f":"Journal!D550","v":0},13,0,0,0,0]
[null,null,null,{"$f":"Journal!A551","v":0},{"$f":"Journal!B551","v":0},{"$f":"Journal!C551","v":0},{"$f":"Journal!D551","v":0},13,0,0,0,0]
[null,null,null,{"$f":"Journal!A552","v":0},{"$f":"Journal!B552","v":0},{"$f":"Journal!C552","v":0},{"$f":"Journal!D552","v":0},13,0,0,0,0]
[null,null,null,{"$f":"Journal!A553","v":0},{"$f":"Journal!B553","v":0},{"$f":"Journal!C553","v":0},{"$f":"Journal!D553","v":0},13,0,0,0,0]
[null,null,null,{"$f":"Journal!A554","v":0},{"$f":"Journal!B554","v":0},{"$f":"Journal!C554","v":0},{"$f":"Journal!D554","v":0},13,0,0,0,0]
[null,null,null,{"$f":"Journal!A555","v":0},{"$f":"Journal!B555","v":0},{"$f":"Journal!C555","v":0},{"$f":"Journal!D555","v":0},13,0,0,0,0]
[null,null,null,{"$f":"Journal!A556","v":0},{"$f":"Journal!B556","v":0},{"$f":"Journal!C556","v":0},{"$f":"Journal!D556","v":0},13,0,0,0,0]
[null,null,null,{"$f":"Journal!A557","v":0},{"$f":"Journal!B557","v":0},{"$f":"Journal!C557","v":0},{"$f":"Journal!D557","v":0},13,0,0,0,0]
[null,null,null,{"$f":"Journal!A558","v":0},{"$f":"Journal!B558","v":0},{"$f":"Journal!C558","v":0},{"$f":"Journal!D558","v":0},13,0,0,0,0]
[null,null,null,{"$f":"Journal!A559","v":0},{"$f":"Journal!B559","v":0},{"$f":"Journal!C559","v":0},{"$f":"Journal!D559","v":0},13,0,0,0,0]
[null,null,null,{"$f":"Journal!A560","v":0},{"$f":"Journal!B560","v":0},{"$f":"Journal!C560","v":0},{"$f":"Journal!D560","v":0},13,0,0,0,0]
[null,null,null,{"$f":"Journal!A561","v":0},{"$f":"Journal!B561","v":0},{"$f":"Journal!C561","v":0},{"$f":"Journal!D561","v":0},13,0,0,0,0]
[null,null,null,{"$f":"Journal!A562","v":0},{"$f":"Journal!B562","v":0},{"$f":"Journal!C562","v":0},{"$f":"Journal!D562","v":0},13,0,0,0,0]
[null,null,null,{"$f":"Journal!A563","v":0},{"$f":"Journal!B563","v":0},{"$f":"Journal!C563","v":0},{"$f":"Journal!D563","v":0},13,0,0,0,0]
[null,null,null,{"$f":"Journal!A564","v":0},{"$f":"Journal!B564","v":0},{"$f":"Journal!C564","v":0},{"$f":"Journal!D564","v":0},13,0,0,0,0]
[null,null,null,{"$f":"Journal!A565","v":0},{"$f":"Journal!B565","v":0},{"$f":"Journal!C565","v":0},{"$f":"Journal!D565","v":0},13,0,0,0,0]
[null,null,null,{"$f":"Journal!A566","v":0},{"$f":"Journal!B566","v":0},{"$f":"Journal!C566","v":0},{"$f":"Journal!D566","v":0},13,0,0,0,0]
[null,null,null,{"$f":"Journal!A567","v":0},{"$f":"Journal!B567","v":0},{"$f":"Journal!C567","v":0},{"$f":"Journal!D567","v":0},13,0,0,0,0]
[null,null,null,{"$f":"Journal!A568","v":0},{"$f":"Journal!B568","v":0},{"$f":"Journal!C568","v":0},{"$f":"Journal!D568","v":0},13,0,0,0,0]
[null,null,null,{"$f":"Journal!A569","v":0},{"$f":"Journal!B569","v":0},{"$f":"Journal!C569","v":0},{"$f":"Journal!D569","v":0},13,0,0,0,0]
[null,null,null,{"$f":"Journal!A570","v":0},{"$f":"Journal!B570","v":0},{"$f":"Journal!C570","v":0},{"$f":"Journal!D570","v":0},13,0,0,0,0]
[null,null,null,{"$f":"Journal!A571","v":0},{"$f":"Journal!B571","v":0},{"$f":"Journal!C571","v":0},{"$f":"Journal!D571","v":0},13,0,0,0,0]
[null,null,null,{"$f":"Journal!A572","v":0},{"$f":"Journal!B572","v":0},{"$f":"Journal!C572","v":0},{"$f":"Journal!D572","v":0},13,0,0,0,0]
[null,null,null,{"$f":"Journal!A573","v":0},{"$f":"Journal!B573","v":0},{"$f":"Journal!C573","v":0},{"$f":"Journal!D573","v":0},13,0,0,0,0]
[null,null,null,{"$f":"Journal!A574","v":0},{"$f":"Journal!B574","v":0},{"$f":"Journal!C574","v":0},{"$f":"Journal!D574","v":0},13,0,0,0,0]
[null,null,null,{"$f":"Journal!A575","v":0},{"$f":"Journal!B575","v":0},{"$f":"Journal!C575","v":0},{"$f":"Journal!D575","v":0},13,0,0,0,0]
[null,null,null,{"$f":"Journal!A576","v":0},{"$f":"Journal!B576","v":0},{"$f":"Journal!C576","v":0},{"$f":"Journal!D576","v":0},13,0,0,0,0]
[null,null,null,{"$f":"Journal!A577","v":0},{"$f":"Journal!B577","v":0},{"$f":"Journal!C577","v":0},{"$f":"Journal!D577","v":0},13,0,0,0,0]
[null,null,null,{"$f":"Journal!A578","v":0},{"$f":"Journal!B578","v":0},{"$f":"Journal!C578","v":0},{"$f":"Journal!D578","v":0},13,0,0,0,0]
[null,null,null,{"$f":"Journal!A579","v":0},{"$f":"Journal!B579","v":0},{"$f":"Journal!C579","v":0},{"$f":"Journal!D579","v":0},13,0,0,0,0]
[null,null,null,{"$f":"Journal!A580","v":0},{"$f":"Journal!B580","v":0},{"$f":"Journal!C580","v":0},{"$f":"Journal!D580","v":0},13,0,0,0,0]
[null,null,null,{"$f":"Journal!A581","v":0},{"$f":"Journal!B581","v":0},{"$f":"Journal!C581","v":0},{"$f":"Journal!D581","v":0},{"$f":"12-G600+1","v":13},{"$f":"IF(AND(E600=0,F600=0),0,IF(1/F600*2.5>25%,25%,1/F600*2.5))","v":0},{"$f":"E600/5","v":0},{"$f":"IF($E600<410.01,$E600,$E600/$F600/12*$H600)","v":0},{"$f":"IF($E600<410.01,$E600,$E600*I600/1/12*$H600)","v":0}]
[null,null,null,{"$f":"Journal!A582","v":0},{"$f":"Journal!B582","v":0},{"$f":"Journal!C582","v":0},{"$f":"Journal!D582","v":0},13,0,0,0,0]
[null,null,null,{"$f":"Journal!A583","v":0},{"$f":"Journal!B583","v":0},{"$f":"Journal!C583","v":0},{"$f":"Journal!D583","v":0},13,0,0,0,0]
[null,null,null,{"$f":"Journal!A584","v":0},{"$f":"Journal!B584","v":0},{"$f":"Journal!C584","v":0},{"$f":"Journal!D584","v":0},13,0,0,0,0]
[null,null,null,{"$f":"Journal!A585","v":0},{"$f":"Journal!B585","v":0},{"$f":"Journal!C585","v":0},{"$f":"Journal!D585","v":0},13,0,0,0,0]
[null,null,null,{"$f":"Journal!A586","v":0},{"$f":"Journal!B586","v":0},{"$f":"Journal!C586","v":0},{"$f":"Journal!D586","v":0},13,0,0,0,0]
[null,null,null,{"$f":"Journal!A587","v":0},{"$f":"Journal!B587","v":0},{"$f":"Journal!C587","v":0},{"$f":"Journal!D587","v":0},13,0,0,0,0]
[null,null,null,{"$f":"Journal!A588","v":0},{"$f":"Journal!B588","v":0},{"$f":"Journal!C588","v":0},{"$f":"Journal!D588","v":0},13,0,0,0,0]
[null,null,null,{"$f":"Journal!A589","v":0},{"$f":"Journal!B589","v":0},{"$f":"Journal!C589","v":0},{"$f":"Journal!D589","v":0},13,0,0,0,0]
[null,null,null,{"$f":"Journal!A590","v":0},{"$f":"Journal!B590","v":0},{"$f":"Journal!C590","v":0},{"$f":"Journal!D590","v":0},13,0,0,0,0]
[null,null,null,{"$f":"Journal!A591","v":0},{"$f":"Journal!B591","v":0},{"$f":"Journal!C591","v":0},{"$f":"Journal!D591","v":0},13,0,0,0,0]
[null,null,null,{"$f":"Journal!A592","v":0},{"$f":"Journal!B592","v":0},{"$f":"Journal!C592","v":0},{"$f":"Journal!D592","v":0},13,0,0,0,0]
[null,null,null,{"$f":"Journal!A593","v":0},{"$f":"Journal!B593","v":0},{"$f":"Journal!C593","v":0},{"$f":"Journal!D593","v":0},13,0,0,0,0]
[null,null,null,{"$f":"Journal!A594","v":0},{"$f":"Journal!B594","v":0},{"$f":"Journal!C594","v":0},{"$f":"Journal!D594","v":0},13,0,0,0,0]
[null,null,null,{"$f":"Journal!A595","v":0},{"$f":"Journal!B595","v":0},{"$f":"Journal!C595","v":0},{"$f":"Journal!D595","v":0},13,0,0,0,0]
[null,null,null,{"$f":"Journal!A596","v":0},{"$f":"Journal!B596","v":0},{"$f":"Journal!C596","v":0},{"$f":"Journal!D596","v":0},13,0,0,0,0]
[null,null,null,{"$f":"Journal!A597","v":0},{"$f":"Journal!B597","v":0},{"$f":"Journal!C597","v":0},{"$f":"Journal!D597","v":0},13,0,0,0,0]
[null,null,null,{"$f":"Journal!A598","v":0},{"$f":"Journal!B598","v":0},{"$f":"Journal!C598","v":0},{"$f":"Journal!D598","v":0},13,0,0,0,0]
[null,null,null,{"$f":"Journal!A599","v":0},{"$f":"Journal!B599","v":0},{"$f":"Journal!C599","v":0},{"$f":"Journal!D599","v":0},13,0,0,0,0]
[null,null,null,{"$f":"Journal!A600","v":0},{"$f":"Journal!B600","v":0},{"$f":"Journal!C600","v":0},{"$f":"Journal!D600","v":0},13,0,0,0,0]
[null,null,null,{"$f":"Journal!A601","v":0},{"$f":"Journal!B601","v":0},{"$f":"Journal!C601","v":0},{"$f":"Journal!D601","v":0},13,0,0,0,0]
[null,null,null,{"$f":"Journal!A602","v":0},{"$f":"Journal!B602","v":0},{"$f":"Journal!C602","v":0},{"$f":"Journal!D602","v":0},13,0,0,0,0]
[null,null,null,{"$f":"Journal!A603","v":0},{"$f":"Journal!B603","v":0},{"$f":"Journal!C603","v":0},{"$f":"Journal!D603","v":0},13,0,0,0,0]
[null,null,null,{"$f":"Journal!A604","v":0},{"$f":"Journal!B604","v":0},{"$f":"Journal!C604","v":0},{"$f":"Journal!D604","v":0},13,0,0,0,0]
[null,null,null,{"$f":"Journal!A605","v":0},{"$f":"Journal!B605","v":0},{"$f":"Journal!C605","v":0},{"$f":"Journal!D605","v":0},13,0,0,0,0]
[null,null,null,{"$f":"Journal!A606","v":0},{"$f":"Journal!B606","v":0},{"$f":"Journal!C606","v":0},{"$f":"Journal!D606","v":0},13,0,0,0,0]
[null,null,null,{"$f":"Journal!A607","v":0},{"$f":"Journal!B607","v":0},{"$f":"Journal!C607","v":0},{"$f":"Journal!D607","v":0},13,0,0,0,0]
[null,null,null,{"$f":"Journal!A608","v":0},{"$f":"Journal!B608","v":0},{"$f":"Journal!C608","v":0},{"$f":"Journal!D608","v":0},13,0,0,0,0]
[null,null,null,{"$f":"Journal!A609","v":0},{"$f":"Journal!B609","v":0},{"$f":"Journal!C609","v":0},{"$f":"Journal!D609","v":0},13,0,0,0,0]
[null,null,null,{"$f":"Journal!A610","v":0},{"$f":"Journal!B610","v":0},{"$f":"Journal!C610","v":0},{"$f":"Journal!D610","v":0},13,0,0,0,0]
[null,null,null,{"$f":"Journal!A611","v":0},{"$f":"Journal!B611","v":0},{"$f":"Journal!C611","v":0},{"$f":"Journal!D611","v":0},13,0,0,0,0]
[null,null,null,{"$f":"Journal!A612","v":0},{"$f":"Journal!B612","v":0},{"$f":"Journal!C612","v":0},{"$f":"Journal!D612","v":0},13,0,0,0,0]
[null,null,null,{"$f":"Journal!A613","v":0},{"$f":"Journal!B613","v":0},{"$f":"Journal!C613","v":0},{"$f":"Journal!D613","v":0},13,0,0,0,0]
[null,null,null,{"$f":"Journal!A614","v":0},{"$f":"Journal!B614","v":0},{"$f":"Journal!C614","v":0},{"$f":"Journal!D614","v":0},13,0,0,0,0]
[null,null,null,{"$f":"Journal!A615","v":0},{"$f":"Journal!B615","v":0},{"$f":"Journal!C615","v":0},{"$f":"Journal!D615","v":0},13,0,0,0,0]
[null,null,null,{"$f":"Journal!A616","v":0},{"$f":"Journal!B616","v":0},{"$f":"Journal!C616","v":0},{"$f":"Journal!D616","v":0},13,0,0,0,0]
[null,null,null,{"$f":"Journal!A617","v":0},{"$f":"Journal!B617","v":0},{"$f":"Journal!C617","v":0},{"$f":"Journal!D617","v":0},13,0,0,0,0]
[null,null,null,{"$f":"Journal!A618","v":0},{"$f":"Journal!B618","v":0},{"$f":"Journal!C618","v":0},{"$f":"Journal!D618","v":0},13,0,0,0,0]
[null,null,null,{"$f":"Journal!A619","v":0},{"$f":"Journal!B619","v":0},{"$f":"Journal!C619","v":0},{"$f":"Journal!D619","v":0},13,0,0,0,0]
[null,null,null,{"$f":"Journal!A620","v":0},{"$f":"Journal!B620","v":0},{"$f":"Journal!C620","v":0},{"$f":"Journal!D620","v":0},13,0,0,0,0]
[null,null,null,{"$f":"Journal!A621","v":0},{"$f":"Journal!B621","v":0},{"$f":"Journal!C621","v":0},{"$f":"Journal!D621","v":0},13,0,0,0,0]
[null,null,null,{"$f":"Journal!A622","v":0},{"$f":"Journal!B622","v":0},{"$f":"Journal!C622","v":0},{"$f":"Journal!D622","v":0},13,0,0,0,0]
[null,null,null,{"$f":"Journal!A623","v":0},{"$f":"Journal!B623","v":0},{"$f":"Journal!C623","v":0},{"$f":"Journal!D623","v":0},13,0,0,0,0]
[null,null,null,{"$f":"Journal!A624","v":0},{"$f":"Journal!B624","v":0},{"$f":"Journal!C624","v":0},{"$f":"Journal!D624","v":0},13,0,0,0,0]
[null,null,null,{"$f":"Journal!A625","v":0},{"$f":"Journal!B625","v":0},{"$f":"Journal!C625","v":0},{"$f":"Journal!D625","v":0},13,0,0,0,0]
[null,null,null,{"$f":"Journal!A626","v":0},{"$f":"Journal!B626","v":0},{"$f":"Journal!C626","v":0},{"$f":"Journal!D626","v":0},13,0,0,0,0]
[null,null,null,{"$f":"Journal!A627","v":0},{"$f":"Journal!B627","v":0},{"$f":"Journal!C627","v":0},{"$f":"Journal!D627","v":0},13,0,0,0,0]
[null,null,null,{"$f":"Journal!A628","v":0},{"$f":"Journal!B628","v":0},{"$f":"Journal!C628","v":0},{"$f":"Journal!D628","v":0},13,0,0,0,0]
[null,null,null,{"$f":"Journal!A629","v":0},{"$f":"Journal!B629","v":0},{"$f":"Journal!C629","v":0},{"$f":"Journal!D629","v":0},13,0,0,0,0]
[null,null,null,{"$f":"Journal!A630","v":0},{"$f":"Journal!B630","v":0},{"$f":"Journal!C630","v":0},{"$f":"Journal!D630","v":0},13,0,0,0,0]
[null,null,null,{"$f":"Journal!A631","v":0},{"$f":"Journal!B631","v":0},{"$f":"Journal!C631","v":0},{"$f":"Journal!D631","v":0},13,0,0,0,0]
[null,null,null,{"$f":"Journal!A632","v":0},{"$f":"Journal!B632","v":0},{"$f":"Journal!C632","v":0},{"$f":"Journal!D632","v":0},13,0,0,0,0]
[null,null,null,{"$f":"Journal!A633","v":0},{"$f":"Journal!B633","v":0},{"$f":"Journal!C633","v":0},{"$f":"Journal!D633","v":0},13,0,0,0,0]
[null,null,null,{"$f":"Journal!A634","v":0},{"$f":"Journal!B634","v":0},{"$f":"Journal!C634","v":0},{"$f":"Journal!D634","v":0},13,0,0,0,0]
[null,null,null,{"$f":"Journal!A635","v":0},{"$f":"Journal!B635","v":0},{"$f":"Journal!C635","v":0},{"$f":"Journal!D635","v":0},13,0,0,0,0]
[null,null,null,{"$f":"Journal!A636","v":0},{"$f":"Journal!B636","v":0},{"$f":"Journal!C636","v":0},{"$f":"Journal!D636","v":0},13,0,0,0,0]
[null,null,null,{"$f":"Journal!A637","v":0},{"$f":"Journal!B637","v":0},{"$f":"Journal!C637","v":0},{"$f":"Journal!D637","v":0},13,0,0,0,0]
[null,null,null,{"$f":"Journal!A638","v":0},{"$f":"Journal!B638","v":0},{"$f":"Journal!C638","v":0},{"$f":"Journal!D638","v":0},13,0,0,0,0]
[null,null,null,{"$f":"Journal!A639","v":0},{"$f":"Journal!B639","v":0},{"$f":"Journal!C639","v":0},{"$f":"Journal!D639","v":0},13,0,0,0,0]
[null,null,null,{"$f":"Journal!A640","v":0},{"$f":"Journal!B640","v":0},{"$f":"Journal!C640","v":0},{"$f":"Journal!D640","v":0},13,0,0,0,0]
[null,null,null,{"$f":"Journal!A641","v":0},{"$f":"Journal!B641","v":0},{"$f":"Journal!C641","v":0},{"$f":"Journal!D641","v":0},13,0,0,0,0]
[null,null,null,{"$f":"Journal!A642","v":0},{"$f":"Journal!B642","v":0},{"$f":"Journal!C642","v":0},{"$f":"Journal!D642","v":0},13,0,0,0,0]
[null,null,null,{"$f":"Journal!A643","v":0},{"$f":"Journal!B643","v":0},{"$f":"Journal!C643","v":0},{"$f":"Journal!D643","v":0},13,0,0,0,0]
[null,null,null,{"$f":"Journal!A644","v":0},{"$f":"Journal!B644","v":0},{"$f":"Journal!C644","v":0},{"$f":"Journal!D644","v":0},13,0,0,0,0]
[null,null,null,{"$f":"Journal!A645","v":0},{"$f":"Journal!B645","v":0},{"$f":"Journal!C645","v":0},{"$f":"Journal!D645","v":0},{"$f":"12-G664+1","v":13},{"$f":"IF(AND(E664=0,F664=0),0,IF(1/F664*2.5>25%,25%,1/F664*2.5))","v":0},{"$f":"E664/5","v":0},{"$f":"IF($E664<410.01,$E664,$E664/$F664/12*$H664)","v":0},{"$f":"IF($E664<410.01,$E664,$E664*I664/1/12*$H664)","v":0}]
[null,null,null,{"$f":"Journal!A646","v":0},{"$f":"Journal!B646","v":0},{"$f":"Journal!C646","v":0},{"$f":"Journal!D646","v":0},13,0,0,0,0]
[null,null,null,{"$f":"Journal!A647","v":0},{"$f":"Journal!B647","v":0},{"$f":"Journal!C647","v":0},{"$f":"Journal!D647","v":0},13,0,0,0,0]
[null,null,null,{"$f":"Journal!A648","v":0},{"$f":"Journal!B648","v":0},{"$f":"Journal!C648","v":0},{"$f":"Journal!D648","v":0},13,0,0,0,0]
[null,null,null,{"$f":"Journal!A649","v":0},{"$f":"Journal!B649","v":0},{"$f":"Journal!C649","v":0},{"$f":"Journal!D649","v":0},13,0,0,0,0]
[null,null,null,{"$f":"Journal!A650","v":0},{"$f":"Journal!B650","v":0},{"$f":"Journal!C650","v":0},{"$f":"Journal!D650","v":0},13,0,0,0,0]
[null,null,null,{"$f":"Journal!A651","v":0},{"$f":"Journal!B651","v":0},{"$f":"Journal!C651","v":0},{"$f":"Journal!D651","v":0},13,0,0,0,0]
[null,null,null,{"$f":"Journal!A652","v":0},{"$f":"Journal!B652","v":0},{"$f":"Journal!C652","v":0},{"$f":"Journal!D652","v":0},13,0,0,0,0]
[null,null,null,{"$f":"Journal!A653","v":0},{"$f":"Journal!B653","v":0},{"$f":"Journal!C653","v":0},{"$f":"Journal!D653","v":0},13,0,0,0,0]
[null,null,null,{"$f":"Journal!A654","v":0},{"$f":"Journal!B654","v":0},{"$f":"Journal!C654","v":0},{"$f":"Journal!D654","v":0},13,0,0,0,0]
[null,null,null,{"$f":"Journal!A655","v":0},{"$f":"Journal!B655","v":0},{"$f":"Journal!C655","v":0},{"$f":"Journal!D655","v":0},13,0,0,0,0]
[null,null,null,{"$f":"Journal!A656","v":0},{"$f":"Journal!B656","v":0},{"$f":"Journal!C656","v":0},{"$f":"Journal!D656","v":0},13,0,0,0,0]
[null,null,null,{"$f":"Journal!A657","v":0},{"$f":"Journal!B657","v":0},{"$f":"Journal!C657","v":0},{"$f":"Journal!D657","v":0},13,0,0,0,0]
[null,null,null,{"$f":"Journal!A658","v":0},{"$f":"Journal!B658","v":0},{"$f":"Journal!C658","v":0},{"$f":"Journal!D658","v":0},13,0,0,0,0]
[null,null,null,{"$f":"Journal!A659","v":0},{"$f":"Journal!B659","v":0},{"$f":"Journal!C659","v":0},{"$f":"Journal!D659","v":0},13,0,0,0,0]
[null,null,null,{"$f":"Journal!A660","v":0},{"$f":"Journal!B660","v":0},{"$f":"Journal!C660","v":0},{"$f":"Journal!D660","v":0},13,0,0,0,0]
[null,null,null,{"$f":"Journal!A661","v":0},{"$f":"Journal!B661","v":0},{"$f":"Journal!C661","v":0},{"$f":"Journal!D661","v":0},13,0,0,0,0]
[null,null,null,{"$f":"Journal!A662","v":0},{"$f":"Journal!B662","v":0},{"$f":"Journal!C662","v":0},{"$f":"Journal!D662","v":0},13,0,0,0,0]
[null,null,null,{"$f":"Journal!A663","v":0},{"$f":"Journal!B663","v":0},{"$f":"Journal!C663","v":0},{"$f":"Journal!D663","v":0},13,0,0,0,0]
[null,null,null,{"$f":"Journal!A664","v":0},{"$f":"Journal!B664","v":0},{"$f":"Journal!C664","v":0},{"$f":"Journal!D664","v":0},13,0,0,0,0]
[null,null,null,{"$f":"Journal!A665","v":0},{"$f":"Journal!B665","v":0},{"$f":"Journal!C665","v":0},{"$f":"Journal!D665","v":0},13,0,0,0,0]
[null,null,null,{"$f":"Journal!A666","v":0},{"$f":"Journal!B666","v":0},{"$f":"Journal!C666","v":0},{"$f":"Journal!D666","v":0},13,0,0,0,0]
[null,null,null,{"$f":"Journal!A667","v":0},{"$f":"Journal!B667","v":0},{"$f":"Journal!C667","v":0},{"$f":"Journal!D667","v":0},13,0,0,0,0]
[null,null,null,{"$f":"Journal!A668","v":0},{"$f":"Journal!B668","v":0},{"$f":"Journal!C668","v":0},{"$f":"Journal!D668","v":0},13,0,0,0,0]
[null,null,null,{"$f":"Journal!A669","v":0},{"$f":"Journal!B669","v":0},{"$f":"Journal!C669","v":0},{"$f":"Journal!D669","v":0},13,0,0,0,0]
[null,null,null,{"$f":"Journal!A670","v":0},{"$f":"Journal!B670","v":0},{"$f":"Journal!C670","v":0},{"$f":"Journal!D670","v":0},13,0,0,0,0]
[null,null,null,{"$f":"Journal!A671","v":0},{"$f":"Journal!B671","v":0},{"$f":"Journal!C671","v":0},{"$f":"Journal!D671","v":0},13,0,0,0,0]
[null,null,null,{"$f":"Journal!A672","v":0},{"$f":"Journal!B672","v":0},{"$f":"Journal!C672","v":0},{"$f":"Journal!D672","v":0},13,0,0,0,0]
[null,null,null,{"$f":"Journal!A673","v":0},{"$f":"Journal!B673","v":0},{"$f":"Journal!C673","v":0},{"$f":"Journal!D673","v":0},13,0,0,0,0]
[null,null,null,{"$f":"Journal!A674","v":0},{"$f":"Journal!B674","v":0},{"$f":"Journal!C674","v":0},{"$f":"Journal!D674","v":0},13,0,0,0,0]
[null,null,null,{"$f":"Journal!A675","v":0},{"$f":"Journal!B675","v":0},{"$f":"Journal!C675","v":0},{"$f":"Journal!D675","v":0},13,0,0,0,0]
[null,null,null,{"$f":"Journal!A676","v":0},{"$f":"Journal!B676","v":0},{"$f":"Journal!C676","v":0},{"$f":"Journal!D676","v":0},13,0,0,0,0]
[null,null,null,{"$f":"Journal!A677","v":0},{"$f":"Journal!B677","v":0},{"$f":"Journal!C677","v":0},{"$f":"Journal!D677","v":0},13,0,0,0,0]
[null,null,null,{"$f":"Journal!A678","v":0},{"$f":"Journal!B678","v":0},{"$f":"Journal!C678","v":0},{"$f":"Journal!D678","v":0},13,0,0,0,0]
[null,null,null,{"$f":"Journal!A679","v":0},{"$f":"Journal!B679","v":0},{"$f":"Journal!C679","v":0},{"$f":"Journal!D679","v":0},13,0,0,0,0]
[null,null,null,{"$f":"Journal!A680","v":0},{"$f":"Journal!B680","v":0},{"$f":"Journal!C680","v":0},{"$f":"Journal!D680","v":0},13,0,0,0,0]
[null,null,null,{"$f":"Journal!A681","v":0},{"$f":"Journal!B681","v":0},{"$f":"Journal!C681","v":0},{"$f":"Journal!D681","v":0},13,0,0,0,0]
[null,null,null,{"$f":"Journal!A682","v":0},{"$f":"Journal!B682","v":0},{"$f":"Journal!C682","v":0},{"$f":"Journal!D682","v":0},13,0,0,0,0]
[null,null,null,{"$f":"Journal!A683","v":0},{"$f":"Journal!B683","v":0},{"$f":"Journal!C683","v":0},{"$f":"Journal!D683","v":0},13,0,0,0,0]
[null,null,null,{"$f":"Journal!A684","v":0},{"$f":"Journal!B684","v":0},{"$f":"Journal!C684","v":0},{"$f":"Journal!D684","v":0},13,0,0,0,0]
[null,null,null,{"$f":"Journal!A685","v":0},{"$f":"Journal!B685","v":0},{"$f":"Journal!C685","v":0},{"$f":"Journal!D685","v":0},13,0,0,0,0]
[null,null,null,{"$f":"Journal!A686","v":0},{"$f":"Journal!B686","v":0},{"$f":"Journal!C686","v":0},{"$f":"Journal!D686","v":0},13,0,0,0,0]
[null,null,null,{"$f":"Journal!A687","v":0},{"$f":"Journal!B687","v":0},{"$f":"Journal!C687","v":0},{"$f":"Journal!D687","v":0},13,0,0,0,0]
[null,null,null,{"$f":"Journal!A688","v":0},{"$f":"Journal!B688","v":0},{"$f":"Journal!C688","v":0},{"$f":"Journal!D688","v":0},13,0,0,0,0]
[null,null,null,{"$f":"Journal!A689","v":0},{"$f":"Journal!B689","v":0},{"$f":"Journal!C689","v":0},{"$f":"Journal!D689","v":0},13,0,0,0,0]
[null,null,null,{"$f":"Journal!A690","v":0},{"$f":"Journal!B690","v":0},{"$f":"Journal!C690","v":0},{"$f":"Journal!D690","v":0},13,0,0,0,0]
[null,null,null,{"$f":"Journal!A691","v":0},{"$f":"Journal!B691","v":0},{"$f":"Journal!C691","v":0},{"$f":"Journal!D691","v":0},13,0,0,0,0]
[null,null,null,{"$f":"Journal!A692","v":0},{"$f":"Journal!B692","v":0},{"$f":"Journal!C692","v":0},{"$f":"Journal!D692","v":0},13,0,0,0,0]
[null,null,null,{"$f":"Journal!A693","v":0},{"$f":"Journal!B693","v":0},{"$f":"Journal!C693","v":0},{"$f":"Journal!D693","v":0},13,0,0,0,0]
[null,null,null,{"$f":"Journal!A694","v":0},{"$f":"Journal!B694","v":0},{"$f":"Journal!C694","v":0},{"$f":"Journal!D694","v":0},13,0,0,0,0]
[null,null,null,{"$f":"Journal!A695","v":0},{"$f":"Journal!B695","v":0},{"$f":"Journal!C695","v":0},{"$f":"Journal!D695","v":0},13,0,0,0,0]
[null,null,null,{"$f":"Journal!A696","v":0},{"$f":"Journal!B696","v":0},{"$f":"Journal!C696","v":0},{"$f":"Journal!D696","v":0},13,0,0,0,0]
[null,null,null,{"$f":"Journal!A697","v":0},{"$f":"Journal!B697","v":0},{"$f":"Journal!C697","v":0},{"$f":"Journal!D697","v":0},13,0,0,0,0]
[null,null,null,{"$f":"Journal!A698","v":0},{"$f":"Journal!B698","v":0},{"$f":"Journal!C698","v":0},{"$f":"Journal!D698","v":0},13,0,0,0,0]
[null,null,null,{"$f":"Journal!A699","v":0},{"$f":"Journal!B699","v":0},{"$f":"Journal!C699","v":0},{"$f":"Journal!D699","v":0},13,0,0,0,0]
[null,null,null,{"$f":"Journal!A700","v":0},{"$f":"Journal!B700","v":0},{"$f":"Journal!C700","v":0},{"$f":"Journal!D700","v":0},13,0,0,0,0]
[null,null,null,{"$f":"Journal!A701","v":0},{"$f":"Journal!B701","v":0},{"$f":"Journal!C701","v":0},{"$f":"Journal!D701","v":0},13,0,0,0,0]
[null,null,null,{"$f":"Journal!A702","v":0},{"$f":"Journal!B702","v":0},{"$f":"Journal!C702","v":0},{"$f":"Journal!D702","v":0},13,0,0,0,0]
[null,null,null,{"$f":"Journal!A703","v":0},{"$f":"Journal!B703","v":0},{"$f":"Journal!C703","v":0},{"$f":"Journal!D703","v":0},13,0,0,0,0]
[null,null,null,{"$f":"Journal!A704","v":0},{"$f":"Journal!B704","v":0},{"$f":"Journal!C704","v":0},{"$f":"Journal!D704","v":0},13,0,0,0,0]
[null,null,null,{"$f":"Journal!A705","v":0},{"$f":"Journal!B705","v":0},{"$f":"Journal!C705","v":0},{"$f":"Journal!D705","v":0},13,0,0,0,0]
[null,null,null,{"$f":"Journal!A706","v":0},{"$f":"Journal!B706","v":0},{"$f":"Journal!C706","v":0},{"$f":"Journal!D706","v":0},13,0,0,0,0]
[null,null,null,{"$f":"Journal!A707","v":0},{"$f":"Journal!B707","v":0},{"$f":"Journal!C707","v":0},{"$f":"Journal!D707","v":0},13,0,0,0,0]
[null,null,null,{"$f":"Journal!A708","v":0},{"$f":"Journal!B708","v":0},{"$f":"Journal!C708","v":0},{"$f":"Journal!D708","v":0},13,0,0,0,0]
[null,null,null,{"$f":"Journal!A709","v":0},{"$f":"Journal!B709","v":0},{"$f":"Journal!C709","v":0},{"$f":"Journal!D709","v":0},{"$f":"12-G728+1","v":13},{"$f":"IF(AND(E728=0,F728=0),0,IF(1/F728*2.5>25%,25%,1/F728*2.5))","v":0},{"$f":"E728/5","v":0},{"$f":"IF($E728<410.01,$E728,$E728/$F728/12*$H728)","v":0},{"$f":"IF($E728<410.01,$E728,$E728*I728/1/12*$H728)","v":0}]
[null,null,null,{"$f":"Journal!A710","v":0},{"$f":"Journal!B710","v":0},{"$f":"Journal!C710","v":0},{"$f":"Journal!D710","v":0},13,0,0,0,0]
[null,null,null,{"$f":"Journal!A711","v":0},{"$f":"Journal!B711","v":0},{"$f":"Journal!C711","v":0},{"$f":"Journal!D711","v":0},13,0,0,0,0]
[null,null,null,{"$f":"Journal!A712","v":0},{"$f":"Journal!B712","v":0},{"$f":"Journal!C712","v":0},{"$f":"Journal!D712","v":0},13,0,0,0,0]
[null,null,null,{"$f":"Journal!A713","v":0},{"$f":"Journal!B713","v":0},{"$f":"Journal!C713","v":0},{"$f":"Journal!D713","v":0},13,0,0,0,0]
[null,null,null,{"$f":"Journal!A714","v":0},{"$f":"Journal!B714","v":0},{"$f":"Journal!C714","v":0},{"$f":"Journal!D714","v":0},13,0,0,0,0]
[null,null,null,{"$f":"Journal!A715","v":0},{"$f":"Journal!B715","v":0},{"$f":"Journal!C715","v":0},{"$f":"Journal!D715","v":0},13,0,0,0,0]
[null,null,null,{"$f":"Journal!A716","v":0},{"$f":"Journal!B716","v":0},{"$f":"Journal!C716","v":0},{"$f":"Journal!D716","v":0},13,0,0,0,0]
[null,null,null,{"$f":"Journal!A717","v":0},{"$f":"Journal!B717","v":0},{"$f":"Journal!C717","v":0},{"$f":"Journal!D717","v":0},13,0,0,0,0]
[null,null,null,{"$f":"Journal!A718","v":0},{"$f":"Journal!B718","v":0},{"$f":"Journal!C718","v":0},{"$f":"Journal!D718","v":0},13,0,0,0,0]
[null,null,null,{"$f":"Journal!A719","v":0},{"$f":"Journal!B719","v":0},{"$f":"Journal!C719","v":0},{"$f":"Journal!D719","v":0},13,0,0,0,0]
[null,null,null,{"$f":"Journal!A720","v":0},{"$f":"Journal!B720","v":0},{"$f":"Journal!C720","v":0},{"$f":"Journal!D720","v":0},13,0,0,0,0]
[null,null,null,{"$f":"Journal!A721","v":0},{"$f":"Journal!B721","v":0},{"$f":"Journal!C721","v":0},{"$f":"Journal!D721","v":0},13,0,0,0,0]
[null,null,null,{"$f":"Journal!A722","v":0},{"$f":"Journal!B722","v":0},{"$f":"Journal!C722","v":0},{"$f":"Journal!D722","v":0},13,0,0,0,0]
[null,null,null,{"$f":"Journal!A723","v":0},{"$f":"Journal!B723","v":0},{"$f":"Journal!C723","v":0},{"$f":"Journal!D723","v":0},13,0,0,0,0]
[null,null,null,{"$f":"Journal!A724","v":0},{"$f":"Journal!B724","v":0},{"$f":"Journal!C724","v":0},{"$f":"Journal!D724","v":0},13,0,0,0,0]
[null,null,null,{"$f":"Journal!A725","v":0},{"$f":"Journal!B725","v":0},{"$f":"Journal!C725","v":0},{"$f":"Journal!D725","v":0},13,0,0,0,0]
[null,null,null,{"$f":"Journal!A726","v":0},{"$f":"Journal!B726","v":0},{"$f":"Journal!C726","v":0},{"$f":"Journal!D726","v":0},13,0,0,0,0]
[null,null,null,{"$f":"Journal!A727","v":0},{"$f":"Journal!B727","v":0},{"$f":"Journal!C727","v":0},{"$f":"Journal!D727","v":0},13,0,0,0,0]
[null,null,null,{"$f":"Journal!A728","v":0},{"$f":"Journal!B728","v":0},{"$f":"Journal!C728","v":0},{"$f":"Journal!D728","v":0},13,0,0,0,0]
[null,null,null,{"$f":"Journal!A729","v":0},{"$f":"Journal!B729","v":0},{"$f":"Journal!C729","v":0},{"$f":"Journal!D729","v":0},13,0,0,0,0]
[null,null,null,{"$f":"Journal!A730","v":0},{"$f":"Journal!B730","v":0},{"$f":"Journal!C730","v":0},{"$f":"Journal!D730","v":0},13,0,0,0,0]
[null,null,null,{"$f":"Journal!A731","v":0},{"$f":"Journal!B731","v":0},{"$f":"Journal!C731","v":0},{"$f":"Journal!D731","v":0},13,0,0,0,0]
[null,null,null,{"$f":"Journal!A732","v":0},{"$f":"Journal!B732","v":0},{"$f":"Journal!C732","v":0},{"$f":"Journal!D732","v":0},13,0,0,0,0]
[null,null,null,{"$f":"Journal!A733","v":0},{"$f":"Journal!B733","v":0},{"$f":"Journal!C733","v":0},{"$f":"Journal!D733","v":0},13,0,0,0,0]
[null,null,null,{"$f":"Journal!A734","v":0},{"$f":"Journal!B734","v":0},{"$f":"Journal!C734","v":0},{"$f":"Journal!D734","v":0},13,0,0,0,0]
[null,null,null,{"$f":"Journal!A735","v":0},{"$f":"Journal!B735","v":0},{"$f":"Journal!C735","v":0},{"$f":"Journal!D735","v":0},13,0,0,0,0]
[null,null,null,{"$f":"Journal!A736","v":0},{"$f":"Journal!B736","v":0},{"$f":"Journal!C736","v":0},{"$f":"Journal!D736","v":0},13,0,0,0,0]
[null,null,null,{"$f":"Journal!A737","v":0},{"$f":"Journal!B737","v":0},{"$f":"Journal!C737","v":0},{"$f":"Journal!D737","v":0},13,0,0,0,0]
[null,null,null,{"$f":"Journal!A738","v":0},{"$f":"Journal!B738","v":0},{"$f":"Journal!C738","v":0},{"$f":"Journal!D738","v":0},13,0,0,0,0]
[null,null,null,{"$f":"Journal!A739","v":0},{"$f":"Journal!B739","v":0},{"$f":"Journal!C739","v":0},{"$f":"Journal!D739","v":0},13,0,0,0,0]
[null,null,null,{"$f":"Journal!A740","v":0},{"$f":"Journal!B740","v":0},{"$f":"Journal!C740","v":0},{"$f":"Journal!D740","v":0},13,0,0,0,0]
[null,null,null,{"$f":"Journal!A741","v":0},{"$f":"Journal!B741","v":0},{"$f":"Journal!C741","v":0},{"$f":"Journal!D741","v":0},13,0,0,0,0]
[null,null,null,{"$f":"Journal!A742","v":0},{"$f":"Journal!B742","v":0},{"$f":"Journal!C742","v":0},{"$f":"Journal!D742","v":0},13,0,0,0,0]
[null,null,null,{"$f":"Journal!A743","v":0},{"$f":"Journal!B743","v":0},{"$f":"Journal!C743","v":0},{"$f":"Journal!D743","v":0},13,0,0,0,0]
[null,null,null,{"$f":"Journal!A744","v":0},{"$f":"Journal!B744","v":0},{"$f":"Journal!C744","v":0},{"$f":"Journal!D744","v":0},13,0,0,0,0]
[null,null,null,{"$f":"Journal!A745","v":0},{"$f":"Journal!B745","v":0},{"$f":"Journal!C745","v":0},{"$f":"Journal!D745","v":0},13,0,0,0,0]
[null,null,null,{"$f":"Journal!A746","v":0},{"$f":"Journal!B746","v":0},{"$f":"Journal!C746","v":0},{"$f":"Journal!D746","v":0},13,0,0,0,0]
[null,null,null,{"$f":"Journal!A747","v":0},{"$f":"Journal!B747","v":0},{"$f":"Journal!C747","v":0},{"$f":"Journal!D747","v":0},13,0,0,0,0]
[null,null,null,{"$f":"Journal!A748","v":0},{"$f":"Journal!B748","v":0},{"$f":"Journal!C748","v":0},{"$f":"Journal!D748","v":0},13,0,0,0,0]
[null,null,null,{"$f":"Journal!A749","v":0},{"$f":"Journal!B749","v":0},{"$f":"Journal!C749","v":0},{"$f":"Journal!D749","v":0},13,0,0,0,0]
[null,null,null,{"$f":"Journal!A750","v":0},{"$f":"Journal!B750","v":0},{"$f":"Journal!C750","v":0},{"$f":"Journal!D750","v":0},13,0,0,0,0]
[null,null,null,{"$f":"Journal!A751","v":0},{"$f":"Journal!B751","v":0},{"$f":"Journal!C751","v":0},{"$f":"Journal!D751","v":0},13,0,0,0,0]
[null,null,null,{"$f":"Journal!A752","v":0},{"$f":"Journal!B752","v":0},{"$f":"Journal!C752","v":0},{"$f":"Journal!D752","v":0},13,0,0,0,0]
[null,null,null,{"$f":"Journal!A753","v":0},{"$f":"Journal!B753","v":0},{"$f":"Journal!C753","v":0},{"$f":"Journal!D753","v":0},13,0,0,0,0]
[null,null,null,{"$f":"Journal!A754","v":0},{"$f":"Journal!B754","v":0},{"$f":"Journal!C754","v":0},{"$f":"Journal!D754","v":0},13,0,0,0,0]
[null,null,null,{"$f":"Journal!A755","v":0},{"$f":"Journal!B755","v":0},{"$f":"Journal!C755","v":0},{"$f":"Journal!D755","v":0},13,0,0,0,0]
[null,null,null,{"$f":"Journal!A756","v":0},{"$f":"Journal!B756","v":0},{"$f":"Journal!C756","v":0},{"$f":"Journal!D756","v":0},13,0,0,0,0]
[null,null,null,{"$f":"Journal!A757","v":0},{"$f":"Journal!B757","v":0},{"$f":"Journal!C757","v":0},{"$f":"Journal!D757","v":0},13,0,0,0,0]
[null,null,null,{"$f":"Journal!A758","v":0},{"$f":"Journal!B758","v":0},{"$f":"Journal!C758","v":0},{"$f":"Journal!D758","v":0},13,0,0,0,0]
[null,null,null,{"$f":"Journal!A759","v":0},{"$f":"Journal!B759","v":0},{"$f":"Journal!C759","v":0},{"$f":"Journal!D759","v":0},13,0,0,0,0]
[null,null,null,{"$f":"Journal!A760","v":0},{"$f":"Journal!B760","v":0},{"$f":"Journal!C760","v":0},{"$f":"Journal!D760","v":0},13,0,0,0,0]
[null,null,null,{"$f":"Journal!A761","v":0},{"$f":"Journal!B761","v":0},{"$f":"Journal!C761","v":0},{"$f":"Journal!D761","v":0},13,0,0,0,0]
[null,null,null,{"$f":"Journal!A762","v":0},{"$f":"Journal!B762","v":0},{"$f":"Journal!C762","v":0},{"$f":"Journal!D762","v":0},13,0,0,0,0]
[null,null,null,{"$f":"Journal!A763","v":0},{"$f":"Journal!B763","v":0},{"$f":"Journal!C763","v":0},{"$f":"Journal!D763","v":0},13,0,0,0,0]
[null,null,null,{"$f":"Journal!A764","v":0},{"$f":"Journal!B764","v":0},{"$f":"Journal!C764","v":0},{"$f":"Journal!D764","v":0},13,0,0,0,0]
[null,null,null,{"$f":"Journal!A765","v":0},{"$f":"Journal!B765","v":0},{"$f":"Journal!C765","v":0},{"$f":"Journal!D765","v":0},13,0,0,0,0]
[null,null,null,{"$f":"Journal!A766","v":0},{"$f":"Journal!B766","v":0},{"$f":"Journal!C766","v":0},{"$f":"Journal!D766","v":0},13,0,0,0,0]
[null,null,null,{"$f":"Journal!A767","v":0},{"$f":"Journal!B767","v":0},{"$f":"Journal!C767","v":0},{"$f":"Journal!D767","v":0},13,0,0,0,0]
[null,null,null,{"$f":"Journal!A768","v":0},{"$f":"Journal!B768","v":0},{"$f":"Journal!C768","v":0},{"$f":"Journal!D768","v":0},13,0,0,0,0]
[null,null,null,{"$f":"Journal!A769","v":0},{"$f":"Journal!B769","v":0},{"$f":"Journal!C769","v":0},{"$f":"Journal!D769","v":0},13,0,0,0,0]
[null,null,null,{"$f":"Journal!A770","v":0},{"$f":"Journal!B770","v":0},{"$f":"Journal!C770","v":0},{"$f":"Journal!D770","v":0},13,0,0,0,0]
[null,null,null,{"$f":"Journal!A771","v":0},{"$f":"Journal!B771","v":0},{"$f":"Journal!C771","v":0},{"$f":"Journal!D771","v":0},13,0,0,0,0]
[null,null,null,{"$f":"Journal!A772","v":0},{"$f":"Journal!B772","v":0},{"$f":"Journal!C772","v":0},{"$f":"Journal!D772","v":0},13,0,0,0,0]
[null,null,null,{"$f":"Journal!A773","v":0},{"$f":"Journal!B773","v":0},{"$f":"Journal!C773","v":0},{"$f":"Journal!D773","v":0},{"$f":"12-G792+1","v":13},{"$f":"IF(AND(E792=0,F792=0),0,IF(1/F792*2.5>25%,25%,1/F792*2.5))","v":0},{"$f":"E792/5","v":0},{"$f":"IF($E792<410.01,$E792,$E792/$F792/12*$H792)","v":0},{"$f":"IF($E792<410.01,$E792,$E792*I792/1/12*$H792)","v":0}]
[null,null,null,{"$f":"Journal!A774","v":0},{"$f":"Journal!B774","v":0},{"$f":"Journal!C774","v":0},{"$f":"Journal!D774","v":0},13,0,0,0,0]
[null,null,null,{"$f":"Journal!A775","v":0},{"$f":"Journal!B775","v":0},{"$f":"Journal!C775","v":0},{"$f":"Journal!D775","v":0},13,0,0,0,0]
[null,null,null,{"$f":"Journal!A776","v":0},{"$f":"Journal!B776","v":0},{"$f":"Journal!C776","v":0},{"$f":"Journal!D776","v":0},13,0,0,0,0]
[null,null,null,{"$f":"Journal!A777","v":0},{"$f":"Journal!B777","v":0},{"$f":"Journal!C777","v":0},{"$f":"Journal!D777","v":0},13,0,0,0,0]
[null,null,null,{"$f":"Journal!A778","v":0},{"$f":"Journal!B778","v":0},{"$f":"Journal!C778","v":0},{"$f":"Journal!D778","v":0},13,0,0,0,0]
[null,null,null,{"$f":"Journal!A779","v":0},{"$f":"Journal!B779","v":0},{"$f":"Journal!C779","v":0},{"$f":"Journal!D779","v":0},13,0,0,0,0]
[null,null,null,{"$f":"Journal!A780","v":0},{"$f":"Journal!B780","v":0},{"$f":"Journal!C780","v":0},{"$f":"Journal!D780","v":0},13,0,0,0,0]
[null,null,null,{"$f":"Journal!A781","v":0},{"$f":"Journal!B781","v":0},{"$f":"Journal!C781","v":0},{"$f":"Journal!D781","v":0},13,0,0,0,0]
[null,null,null,{"$f":"Journal!A782","v":0},{"$f":"Journal!B782","v":0},{"$f":"Journal!C782","v":0},{"$f":"Journal!D782","v":0},13,0,0,0,0]
[null,null,null,{"$f":"Journal!A783","v":0},{"$f":"Journal!B783","v":0},{"$f":"Journal!C783","v":0},{"$f":"Journal!D783","v":0},13,0,0,0,0]
[null,null,null,{"$f":"Journal!A784","v":0},{"$f":"Journal!B784","v":0},{"$f":"Journal!C784","v":0},{"$f":"Journal!D784","v":0},13,0,0,0,0]
[null,null,null,{"$f":"Journal!A785","v":0},{"$f":"Journal!B785","v":0},{"$f":"Journal!C785","v":0},{"$f":"Journal!D785","v":0},13,0,0,0,0]
[null,null,null,{"$f":"Journal!A786","v":0},{"$f":"Journal!B786","v":0},{"$f":"Journal!C786","v":0},{"$f":"Journal!D786","v":0},13,0,0,0,0]
[null,null,null,{"$f":"Journal!A787","v":0},{"$f":"Journal!B787","v":0},{"$f":"Journal!C787","v":0},{"$f":"Journal!D787","v":0},13,0,0,0,0]
[null,null,null,{"$f":"Journal!A788","v":0},{"$f":"Journal!B788","v":0},{"$f":"Journal!C788","v":0},{"$f":"Journal!D788","v":0},13,0,0,0,0]
[null,null,null,{"$f":"Journal!A789","v":0},{"$f":"Journal!B789","v":0},{"$f":"Journal!C789","v":0},{"$f":"Journal!D789","v":0},13,0,0,0,0]
[null,null,null,{"$f":"Journal!A790","v":0},{"$f":"Journal!B790","v":0},{"$f":"Journal!C790","v":0},{"$f":"Journal!D790","v":0},13,0,0,0,0]
[null,null,null,{"$f":"Journal!A791","v":0},{"$f":"Journal!B791","v":0},{"$f":"Journal!C791","v":0},{"$f":"Journal!D791","v":0},13,0,0,0,0]
[null,null,null,{"$f":"Journal!A792","v":0},{"$f":"Journal!B792","v":0},{"$f":"Journal!C792","v":0},{"$f":"Journal!D792","v":0},13,0,0,0,0]
[null,null,null,{"$f":"Journal!A793","v":0},{"$f":"Journal!B793","v":0},{"$f":"Journal!C793","v":0},{"$f":"Journal!D793","v":0},13,0,0,0,0]
[null,null,null,{"$f":"Journal!A794","v":0},{"$f":"Journal!B794","v":0},{"$f":"Journal!C794","v":0},{"$f":"Journal!D794","v":0},13,0,0,0,0]
[null,null,null,{"$f":"Journal!A795","v":0},{"$f":"Journal!B795","v":0},{"$f":"Journal!C795","v":0},{"$f":"Journal!D795","v":0},13,0,0,0,0]
[null,null,null,{"$f":"Journal!A796","v":0},{"$f":"Journal!B796","v":0},{"$f":"Journal!C796","v":0},{"$f":"Journal!D796","v":0},13,0,0,0,0]
[null,null,null,{"$f":"Journal!A797","v":0},{"$f":"Journal!B797","v":0},{"$f":"Journal!C797","v":0},{"$f":"Journal!D797","v":0},13,0,0,0,0]
[null,null,null,{"$f":"Journal!A798","v":0},{"$f":"Journal!B798","v":0},{"$f":"Journal!C798","v":0},{"$f":"Journal!D798","v":0},13,0,0,0,0]
[null,null,null,{"$f":"Journal!A799","v":0},{"$f":"Journal!B799","v":0},{"$f":"Journal!C799","v":0},{"$f":"Journal!D799","v":0},13,0,0,0,0]
[null,null,null,{"$f":"Journal!A800","v":0},{"$f":"Journal!B800","v":0},{"$f":"Journal!C800","v":0},{"$f":"Journal!D800","v":0},13,0,0,0,0]
[null,null,null,{"$f":"Journal!A801","v":0},{"$f":"Journal!B801","v":0},{"$f":"Journal!C801","v":0},{"$f":"Journal!D801","v":0},13,0,0,0,0]
[null,null,null,{"$f":"Journal!A802","v":0},{"$f":"Journal!B802","v":0},{"$f":"Journal!C802","v":0},{"$f":"Journal!D802","v":0},13,0,0,0,0]
[null,null,null,{"$f":"Journal!A803","v":0},{"$f":"Journal!B803","v":0},{"$f":"Journal!C803","v":0},{"$f":"Journal!D803","v":0},13,0,0,0,0]
[null,null,null,{"$f":"Journal!A804","v":0},{"$f":"Journal!B804","v":0},{"$f":"Journal!C804","v":0},{"$f":"Journal!D804","v":0},13,0,0,0,0]
[null,null,null,{"$f":"Journal!A805","v":0},{"$f":"Journal!B805","v":0},{"$f":"Journal!C805","v":0},{"$f":"Journal!D805","v":0},13,0,0,0,0]
[null,null,null,{"$f":"Journal!A806","v":0},{"$f":"Journal!B806","v":0},{"$f":"Journal!C806","v":0},{"$f":"Journal!D806","v":0},13,0,0,0,0]
[null,null,null,{"$f":"Journal!A807","v":0},{"$f":"Journal!B807","v":0},{"$f":"Journal!C807","v":0},{"$f":"Journal!D807","v":0},13,0,0,0,0]
[null,null,null,{"$f":"Journal!A808","v":0},{"$f":"Journal!B808","v":0},{"$f":"Journal!C808","v":0},{"$f":"Journal!D808","v":0},13,0,0,0,0]
[null,null,null,{"$f":"Journal!A809","v":0},{"$f":"Journal!B809","v":0},{"$f":"Journal!C809","v":0},{"$f":"Journal!D809","v":0},13,0,0,0,0]
[null,null,null,{"$f":"Journal!A810","v":0},{"$f":"Journal!B810","v":0},{"$f":"Journal!C810","v":0},{"$f":"Journal!D810","v":0},13,0,0,0,0]
[null,null,null,{"$f":"Journal!A811","v":0},{"$f":"Journal!B811","v":0},{"$f":"Journal!C811","v":0},{"$f":"Journal!D811","v":0},13,0,0,0,0]
[null,null,null,{"$f":"Journal!A812","v":0},{"$f":"Journal!B812","v":0},{"$f":"Journal!C812","v":0},{"$f":"Journal!D812","v":0},13,0,0,0,0]
[null,null,null,{"$f":"Journal!A813","v":0},{"$f":"Journal!B813","v":0},{"$f":"Journal!C813","v":0},{"$f":"Journal!D813","v":0},13,0,0,0,0]
[null,null,null,{"$f":"Journal!A814","v":0},{"$f":"Journal!B814","v":0},{"$f":"Journal!C814","v":0},{"$f":"Journal!D814","v":0},13,0,0,0,0]
[null,null,null,{"$f":"Journal!A815","v":0},{"$f":"Journal!B815","v":0},{"$f":"Journal!C815","v":0},{"$f":"Journal!D815","v":0},13,0,0,0,0]
[null,null,null,{"$f":"Journal!A816","v":0},{"$f":"Journal!B816","v":0},{"$f":"Journal!C816","v":0},{"$f":"Journal!D816","v":0},13,0,0,0,0]
[null,null,null,{"$f":"Journal!A817","v":0},{"$f":"Journal!B817","v":0},{"$f":"Journal!C817","v":0},{"$f":"Journal!D817","v":0},13,0,0,0,0]
[null,null,null,{"$f":"Journal!A818","v":0},{"$f":"Journal!B818","v":0},{"$f":"Journal!C818","v":0},{"$f":"Journal!D818","v":0},13,0,0,0,0]
[null,null,null,{"$f":"Journal!A819","v":0},{"$f":"Journal!B819","v":0},{"$f":"Journal!C819","v":0},{"$f":"Journal!D819","v":0},13,0,0,0,0]
[null,null,null,{"$f":"Journal!A820","v":0},{"$f":"Journal!B820","v":0},{"$f":"Journal!C820","v":0},{"$f":"Journal!D820","v":0},13,0,0,0,0]
[null,null,null,{"$f":"Journal!A821","v":0},{"$f":"Journal!B821","v":0},{"$f":"Journal!C821","v":0},{"$f":"Journal!D821","v":0},13,0,0,0,0]
[null,null,null,{"$f":"Journal!A822","v":0},{"$f":"Journal!B822","v":0},{"$f":"Journal!C822","v":0},{"$f":"Journal!D822","v":0},13,0,0,0,0]
[null,null,null,{"$f":"Journal!A823","v":0},{"$f":"Journal!B823","v":0},{"$f":"Journal!C823","v":0},{"$f":"Journal!D823","v":0},13,0,0,0,0]
[null,null,null,{"$f":"Journal!A824","v":0},{"$f":"Journal!B824","v":0},{"$f":"Journal!C824","v":0},{"$f":"Journal!D824","v":0},13,0,0,0,0]
[null,null,null,{"$f":"Journal!A825","v":0},{"$f":"Journal!B825","v":0},{"$f":"Journal!C825","v":0},{"$f":"Journal!D825","v":0},13,0,0,0,0]
[null,null,null,{"$f":"Journal!A826","v":0},{"$f":"Journal!B826","v":0},{"$f":"Journal!C826","v":0},{"$f":"Journal!D826","v":0},13,0,0,0,0]
[null,null,null,{"$f":"Journal!A827","v":0},{"$f":"Journal!B827","v":0},{"$f":"Journal!C827","v":0},{"$f":"Journal!D827","v":0},13,0,0,0,0]
[null,null,null,{"$f":"Journal!A828","v":0},{"$f":"Journal!B828","v":0},{"$f":"Journal!C828","v":0},{"$f":"Journal!D828","v":0},13,0,0,0,0]
[null,null,null,{"$f":"Journal!A829","v":0},{"$f":"Journal!B829","v":0},{"$f":"Journal!C829","v":0},{"$f":"Journal!D829","v":0},13,0,0,0,0]
[null,null,null,{"$f":"Journal!A830","v":0},{"$f":"Journal!B830","v":0},{"$f":"Journal!C830","v":0},{"$f":"Journal!D830","v":0},13,0,0,0,0]
[null,null,null,{"$f":"Journal!A831","v":0},{"$f":"Journal!B831","v":0},{"$f":"Journal!C831","v":0},{"$f":"Journal!D831","v":0},13,0,0,0,0]
[null,null,null,{"$f":"Journal!A832","v":0},{"$f":"Journal!B832","v":0},{"$f":"Journal!C832","v":0},{"$f":"Journal!D832","v":0},13,0,0,0,0]
[null,null,null,{"$f":"Journal!A833","v":0},{"$f":"Journal!B833","v":0},{"$f":"Journal!C833","v":0},{"$f":"Journal!D833","v":0},13,0,0,0,0]
[null,null,null,{"$f":"Journal!A834","v":0},{"$f":"Journal!B834","v":0},{"$f":"Journal!C834","v":0},{"$f":"Journal!D834","v":0},13,0,0,0,0]
[null,null,null,{"$f":"Journal!A835","v":0},{"$f":"Journal!B835","v":0},{"$f":"Journal!C835","v":0},{"$f":"Journal!D835","v":0},13,0,0,0,0]
[null,null,null,{"$f":"Journal!A836","v":0},{"$f":"Journal!B836","v":0},{"$f":"Journal!C836","v":0},{"$f":"Journal!D836","v":0},13,0,0,0,0]
[null,null,null,{"$f":"Journal!A837","v":0},{"$f":"Journal!B837","v":0},{"$f":"Journal!C837","v":0},{"$f":"Journal!D837","v":0},{"$f":"12-G856+1","v":13},{"$f":"IF(AND(E856=0,F856=0),0,IF(1/F856*2.5>25%,25%,1/F856*2.5))","v":0},{"$f":"E856/5","v":0},{"$f":"IF($E856<410.01,$E856,$E856/$F856/12*$H856)","v":0},{"$f":"IF($E856<410.01,$E856,$E856*I856/1/12*$H856)","v":0}]
[null,null,null,{"$f":"Journal!A838","v":0},{"$f":"Journal!B838","v":0},{"$f":"Journal!C838","v":0},{"$f":"Journal!D838","v":0},13,0,0,0,0]
[null,null,null,{"$f":"Journal!A839","v":0},{"$f":"Journal!B839","v":0},{"$f":"Journal!C839","v":0},{"$f":"Journal!D839","v":0},13,0,0,0,0]
[null,null,null,{"$f":"Journal!A840","v":0},{"$f":"Journal!B840","v":0},{"$f":"Journal!C840","v":0},{"$f":"Journal!D840","v":0},13,0,0,0,0]
[null,null,null,{"$f":"Journal!A841","v":0},{"$f":"Journal!B841","v":0},{"$f":"Journal!C841","v":0},{"$f":"Journal!D841","v":0},13,0,0,0,0]
[null,null,null,{"$f":"Journal!A842","v":0},{"$f":"Journal!B842","v":0},{"$f":"Journal!C842","v":0},{"$f":"Journal!D842","v":0},13,0,0,0,0]
[null,null,null,{"$f":"Journal!A843","v":0},{"$f":"Journal!B843","v":0},{"$f":"Journal!C843","v":0},{"$f":"Journal!D843","v":0},13,0,0,0,0]
[null,null,null,{"$f":"Journal!A844","v":0},{"$f":"Journal!B844","v":0},{"$f":"Journal!C844","v":0},{"$f":"Journal!D844","v":0},13,0,0,0,0]
[null,null,null,{"$f":"Journal!A845","v":0},{"$f":"Journal!B845","v":0},{"$f":"Journal!C845","v":0},{"$f":"Journal!D845","v":0},13,0,0,0,0]
[null,null,null,{"$f":"Journal!A846","v":0},{"$f":"Journal!B846","v":0},{"$f":"Journal!C846","v":0},{"$f":"Journal!D846","v":0},13,0,0,0,0]
[null,null,null,{"$f":"Journal!A847","v":0},{"$f":"Journal!B847","v":0},{"$f":"Journal!C847","v":0},{"$f":"Journal!D847","v":0},13,0,0,0,0]
[null,null,null,{"$f":"Journal!A848","v":0},{"$f":"Journal!B848","v":0},{"$f":"Journal!C848","v":0},{"$f":"Journal!D848","v":0},13,0,0,0,0]
[null,null,null,{"$f":"Journal!A849","v":0},{"$f":"Journal!B849","v":0},{"$f":"Journal!C849","v":0},{"$f":"Journal!D849","v":0},13,0,0,0,0]
[null,null,null,{"$f":"Journal!A850","v":0},{"$f":"Journal!B850","v":0},{"$f":"Journal!C850","v":0},{"$f":"Journal!D850","v":0},13,0,0,0,0]
[null,null,null,{"$f":"Journal!A851","v":0},{"$f":"Journal!B851","v":0},{"$f":"Journal!C851","v":0},{"$f":"Journal!D851","v":0},13,0,0,0,0]
[null,null,null,{"$f":"Journal!A852","v":0},{"$f":"Journal!B852","v":0},{"$f":"Journal!C852","v":0},{"$f":"Journal!D852","v":0},13,0,0,0,0]
[null,null,null,{"$f":"Journal!A853","v":0},{"$f":"Journal!B853","v":0},{"$f":"Journal!C853","v":0},{"$f":"Journal!D853","v":0},13,0,0,0,0]
[null,null,null,{"$f":"Journal!A854","v":0},{"$f":"Journal!B854","v":0},{"$f":"Journal!C854","v":0},{"$f":"Journal!D854","v":0},13,0,0,0,0]
[null,null,null,{"$f":"Journal!A855","v":0},{"$f":"Journal!B855","v":0},{"$f":"Journal!C855","v":0},{"$f":"Journal!D855","v":0},13,0,0,0,0]
[null,null,null,{"$f":"Journal!A856","v":0},{"$f":"Journal!B856","v":0},{"$f":"Journal!C856","v":0},{"$f":"Journal!D856","v":0},13,0,0,0,0]
[null,null,null,{"$f":"Journal!A857","v":0},{"$f":"Journal!B857","v":0},{"$f":"Journal!C857","v":0},{"$f":"Journal!D857","v":0},13,0,0,0,0]
[null,null,null,{"$f":"Journal!A858","v":0},{"$f":"Journal!B858","v":0},{"$f":"Journal!C858","v":0},{"$f":"Journal!D858","v":0},13,0,0,0,0]
[null,null,null,{"$f":"Journal!A859","v":0},{"$f":"Journal!B859","v":0},{"$f":"Journal!C859","v":0},{"$f":"Journal!D859","v":0},13,0,0,0,0]
[null,null,null,{"$f":"Journal!A860","v":0},{"$f":"Journal!B860","v":0},{"$f":"Journal!C860","v":0},{"$f":"Journal!D860","v":0},13,0,0,0,0]
[null,null,null,{"$f":"Journal!A861","v":0},{"$f":"Journal!B861","v":0},{"$f":"Journal!C861","v":0},{"$f":"Journal!D861","v":0},13,0,0,0,0]
[null,null,null,{"$f":"Journal!A862","v":0},{"$f":"Journal!B862","v":0},{"$f":"Journal!C862","v":0},{"$f":"Journal!D862","v":0},13,0,0,0,0]
[null,null,null,{"$f":"Journal!A863","v":0},{"$f":"Journal!B863","v":0},{"$f":"Journal!C863","v":0},{"$f":"Journal!D863","v":0},13,0,0,0,0]
[null,null,null,{"$f":"Journal!A864","v":0},{"$f":"Journal!B864","v":0},{"$f":"Journal!C864","v":0},{"$f":"Journal!D864","v":0},13,0,0,0,0]
[null,null,null,{"$f":"Journal!A865","v":0},{"$f":"Journal!B865","v":0},{"$f":"Journal!C865","v":0},{"$f":"Journal!D865","v":0},13,0,0,0,0]
[null,null,null,{"$f":"Journal!A866","v":0},{"$f":"Journal!B866","v":0},{"$f":"Journal!C866","v":0},{"$f":"Journal!D866","v":0},13,0,0,0,0]
[null,null,null,{"$f":"Journal!A867","v":0},{"$f":"Journal!B867","v":0},{"$f":"Journal!C867","v":0},{"$f":"Journal!D867","v":0},13,0,0,0,0]
[null,null,null,{"$f":"Journal!A868","v":0},{"$f":"Journal!B868","v":0},{"$f":"Journal!C868","v":0},{"$f":"Journal!D868","v":0},13,0,0,0,0]
[null,null,null,{"$f":"Journal!A869","v":0},{"$f":"Journal!B869","v":0},{"$f":"Journal!C869","v":0},{"$f":"Journal!D869","v":0},13,0,0,0,0]
[null,null,null,{"$f":"Journal!A870","v":0},{"$f":"Journal!B870","v":0},{"$f":"Journal!C870","v":0},{"$f":"Journal!D870","v":0},13,0,0,0,0]
[null,null,null,{"$f":"Journal!A871","v":0},{"$f":"Journal!B871","v":0},{"$f":"Journal!C871","v":0},{"$f":"Journal!D871","v":0},13,0,0,0,0]
[null,null,null,{"$f":"Journal!A872","v":0},{"$f":"Journal!B872","v":0},{"$f":"Journal!C872","v":0},{"$f":"Journal!D872","v":0},13,0,0,0,0]
[null,null,null,{"$f":"Journal!A873","v":0},{"$f":"Journal!B873","v":0},{"$f":"Journal!C873","v":0},{"$f":"Journal!D873","v":0},13,0,0,0,0]
[null,null,null,{"$f":"Journal!A874","v":0},{"$f":"Journal!B874","v":0},{"$f":"Journal!C874","v":0},{"$f":"Journal!D874","v":0},13,0,0,0,0]
[null,null,null,{"$f":"Journal!A875","v":0},{"$f":"Journal!B875","v":0},{"$f":"Journal!C875","v":0},{"$f":"Journal!D875","v":0},13,0,0,0,0]
[null,null,null,{"$f":"Journal!A876","v":0},{"$f":"Journal!B876","v":0},{"$f":"Journal!C876","v":0},{"$f":"Journal!D876","v":0},13,0,0,0,0]
[null,null,null,{"$f":"Journal!A877","v":0},{"$f":"Journal!B877","v":0},{"$f":"Journal!C877","v":0},{"$f":"Journal!D877","v":0},13,0,0,0,0]
[null,null,null,{"$f":"Journal!A878","v":0},{"$f":"Journal!B878","v":0},{"$f":"Journal!C878","v":0},{"$f":"Journal!D878","v":0},13,0,0,0,0]
[null,null,null,{"$f":"Journal!A879","v":0},{"$f":"Journal!B879","v":0},{"$f":"Journal!C879","v":0},{"$f":"Journal!D879","v":0},13,0,0,0,0]
[null,null,null,{"$f":"Journal!A880","v":0},{"$f":"Journal!B880","v":0},{"$f":"Journal!C880","v":0},{"$f":"Journal!D880","v":0},13,0,0,0,0]
[null,null,null,{"$f":"Journal!A881","v":0},{"$f":"Journal!B881","v":0},{"$f":"Journal!C881","v":0},{"$f":"Journal!D881","v":0},13,0,0,0,0]
[null,null,null,{"$f":"Journal!A882","v":0},{"$f":"Journal!B882","v":0},{"$f":"Journal!C882","v":0},{"$f":"Journal!D882","v":0},13,0,0,0,0]
[null,null,null,{"$f":"Journal!A883","v":0},{"$f":"Journal!B883","v":0},{"$f":"Journal!C883","v":0},{"$f":"Journal!D883","v":0},13,0,0,0,0]
[null,null,null,{"$f":"Journal!A884","v":0},{"$f":"Journal!B884","v":0},{"$f":"Journal!C884","v":0},{"$f":"Journal!D884","v":0},13,0,0,0,0]
[null,null,null,{"$f":"Journal!A885","v":0},{"$f":"Journal!B885","v":0},{"$f":"Journal!C885","v":0},{"$f":"Journal!D885","v":0},13,0,0,0,0]
[null,null,null,{"$f":"Journal!A886","v":0},{"$f":"Journal!B886","v":0},{"$f":"Journal!C886","v":0},{"$f":"Journal!D886","v":0},13,0,0,0,0]
[null,null,null,{"$f":"Journal!A887","v":0},{"$f":"Journal!B887","v":0},{"$f":"Journal!C887","v":0},{"$f":"Journal!D887","v":0},13,0,0,0,0]
[null,null,null,{"$f":"Journal!A888","v":0},{"$f":"Journal!B888","v":0},{"$f":"Journal!C888","v":0},{"$f":"Journal!D888","v":0},13,0,0,0,0]
[null,null,null,{"$f":"Journal!A889","v":0},{"$f":"Journal!B889","v":0},{"$f":"Journal!C889","v":0},{"$f":"Journal!D889","v":0},13,0,0,0,0]
[null,null,null,{"$f":"Journal!A890","v":0},{"$f":"Journal!B890","v":0},{"$f":"Journal!C890","v":0},{"$f":"Journal!D890","v":0},13,0,0,0,0]
[null,null,null,{"$f":"Journal!A891","v":0},{"$f":"Journal!B891","v":0},{"$f":"Journal!C891","v":0},{"$f":"Journal!D891","v":0},13,0,0,0,0]
[null,null,null,{"$f":"Journal!A892","v":0},{"$f":"Journal!B892","v":0},{"$f":"Journal!C892","v":0},{"$f":"Journal!D892","v":0},13,0,0,0,0]
[null,null,null,{"$f":"Journal!A893","v":0},{"$f":"Journal!B893","v":0},{"$f":"Journal!C893","v":0},{"$f":"Journal!D893","v":0},13,0,0,0,0]
[null,null,null,{"$f":"Journal!A894","v":0},{"$f":"Journal!B894","v":0},{"$f":"Journal!C894","v":0},{"$f":"Journal!D894","v":0},13,0,0,0,0]
[null,null,null,{"$f":"Journal!A895","v":0},{"$f":"Journal!B895","v":0},{"$f":"Journal!C895","v":0},{"$f":"Journal!D895","v":0},13,0,0,0,0]
[null,null,null,{"$f":"Journal!A896","v":0},{"$f":"Journal!B896","v":0},{"$f":"Journal!C896","v":0},{"$f":"Journal!D896","v":0},13,0,0,0,0]
[null,null,null,{"$f":"Journal!A897","v":0},{"$f":"Journal!B897","v":0},{"$f":"Journal!C897","v":0},{"$f":"Journal!D897","v":0},13,0,0,0,0]
[null,null,null,{"$f":"Journal!A898","v":0},{"$f":"Journal!B898","v":0},{"$f":"Journal!C898","v":0},{"$f":"Journal!D898","v":0},13,0,0,0,0]
[null,null,null,{"$f":"Journal!A899","v":0},{"$f":"Journal!B899","v":0},{"$f":"Journal!C899","v":0},{"$f":"Journal!D899","v":0},13,0,0,0,0]
[null,null,null,{"$f":"Journal!A900","v":0},{"$f":"Journal!B900","v":0},{"$f":"Journal!C900","v":0},{"$f":"Journal!D900","v":0},13,0,0,0,0]
[null,null,null,{"$f":"Journal!A901","v":0},{"$f":"Journal!B901","v":0},{"$f":"Journal!C901","v":0},{"$f":"Journal!D901","v":0},{"$f":"12-G920+1","v":13},{"$f":"IF(AND(E920=0,F920=0),0,IF(1/F920*2.5>25%,25%,1/F920*2.5))","v":0},{"$f":"E920/5","v":0},{"$f":"IF($E920<410.01,$E920,$E920/$F920/12*$H920)","v":0},{"$f":"IF($E920<410.01,$E920,$E920*I920/1/12*$H920)","v":0}]
[null,null,null,{"$f":"Journal!A902","v":0},{"$f":"Journal!B902","v":0},{"$f":"Journal!C902","v":0},{"$f":"Journal!D902","v":0},13,0,0,0,0]
[null,null,null,{"$f":"Journal!A903","v":0},{"$f":"Journal!B903","v":0},{"$f":"Journal!C903","v":0},{"$f":"Journal!D903","v":0},13,0,0,0,0]
[null,null,null,{"$f":"Journal!A904","v":0},{"$f":"Journal!B904","v":0},{"$f":"Journal!C904","v":0},{"$f":"Journal!D904","v":0},13,0,0,0,0]
[null,null,null,{"$f":"Journal!A905","v":0},{"$f":"Journal!B905","v":0},{"$f":"Journal!C905","v":0},{"$f":"Journal!D905","v":0},13,0,0,0,0]
[null,null,null,{"$f":"Journal!A906","v":0},{"$f":"Journal!B906","v":0},{"$f":"Journal!C906","v":0},{"$f":"Journal!D906","v":0},13,0,0,0,0]
[null,null,null,{"$f":"Journal!A907","v":0},{"$f":"Journal!B907","v":0},{"$f":"Journal!C907","v":0},{"$f":"Journal!D907","v":0},13,0,0,0,0]
[null,null,null,{"$f":"Journal!A908","v":0},{"$f":"Journal!B908","v":0},{"$f":"Journal!C908","v":0},{"$f":"Journal!D908","v":0},13,0,0,0,0]
[null,null,null,{"$f":"Journal!A909","v":0},{"$f":"Journal!B909","v":0},{"$f":"Journal!C909","v":0},{"$f":"Journal!D909","v":0},13,0,0,0,0]
[null,null,null,{"$f":"Journal!A910","v":0},{"$f":"Journal!B910","v":0},{"$f":"Journal!C910","v":0},{"$f":"Journal!D910","v":0},13,0,0,0,0]
[null,null,null,{"$f":"Journal!A911","v":0},{"$f":"Journal!B911","v":0},{"$f":"Journal!C911","v":0},{"$f":"Journal!D911","v":0},13,0,0,0,0]
[null,null,null,{"$f":"Journal!A912","v":0},{"$f":"Journal!B912","v":0},{"$f":"Journal!C912","v":0},{"$f":"Journal!D912","v":0},13,0,0,0,0]
[null,null,null,{"$f":"Journal!A913","v":0},{"$f":"Journal!B913","v":0},{"$f":"Journal!C913","v":0},{"$f":"Journal!D913","v":0},13,0,0,0,0]
[null,null,null,{"$f":"Journal!A914","v":0},{"$f":"Journal!B914","v":0},{"$f":"Journal!C914","v":0},{"$f":"Journal!D914","v":0},13,0,0,0,0]
[null,null,null,{"$f":"Journal!A915","v":0},{"$f":"Journal!B915","v":0},{"$f":"Journal!C915","v":0},{"$f":"Journal!D915","v":0},13,0,0,0,0]
[null,null,null,{"$f":"Journal!A916","v":0},{"$f":"Journal!B916","v":0},{"$f":"Journal!C916","v":0},{"$f":"Journal!D916","v":0},13,0,0,0,0]
[null,null,null,{"$f":"Journal!A917","v":0},{"$f":"Journal!B917","v":0},{"$f":"Journal!C917","v":0},{"$f":"Journal!D917","v":0},13,0,0,0,0]
[null,null,null,{"$f":"Journal!A918","v":0},{"$f":"Journal!B918","v":0},{"$f":"Journal!C918","v":0},{"$f":"Journal!D918","v":0},13,0,0,0,0]
[null,null,null,{"$f":"Journal!A919","v":0},{"$f":"Journal!B919","v":0},{"$f":"Journal!C919","v":0},{"$f":"Journal!D919","v":0},13,0,0,0,0]
[null,null,null,{"$f":"Journal!A920","v":0},{"$f":"Journal!B920","v":0},{"$f":"Journal!C920","v":0},{"$f":"Journal!D920","v":0},13,0,0,0,0]
[null,null,null,{"$f":"Journal!A921","v":0},{"$f":"Journal!B921","v":0},{"$f":"Journal!C921","v":0},{"$f":"Journal!D921","v":0},13,0,0,0,0]
[null,null,null,{"$f":"Journal!A922","v":0},{"$f":"Journal!B922","v":0},{"$f":"Journal!C922","v":0},{"$f":"Journal!D922","v":0},13,0,0,0,0]
[null,null,null,{"$f":"Journal!A923","v":0},{"$f":"Journal!B923","v":0},{"$f":"Journal!C923","v":0},{"$f":"Journal!D923","v":0},13,0,0,0,0]
[null,null,null,{"$f":"Journal!A924","v":0},{"$f":"Journal!B924","v":0},{"$f":"Journal!C924","v":0},{"$f":"Journal!D924","v":0},13,0,0,0,0]
[null,null,null,{"$f":"Journal!A925","v":0},{"$f":"Journal!B925","v":0},{"$f":"Journal!C925","v":0},{"$f":"Journal!D925","v":0},13,0,0,0,0]
[null,null,null,{"$f":"Journal!A926","v":0},{"$f":"Journal!B926","v":0},{"$f":"Journal!C926","v":0},{"$f":"Journal!D926","v":0},13,0,0,0,0]
[null,null,null,{"$f":"Journal!A927","v":0},{"$f":"Journal!B927","v":0},{"$f":"Journal!C927","v":0},{"$f":"Journal!D927","v":0},13,0,0,0,0]
[null,null,null,{"$f":"Journal!A928","v":0},{"$f":"Journal!B928","v":0},{"$f":"Journal!C928","v":0},{"$f":"Journal!D928","v":0},13,0,0,0,0]
[null,null,null,{"$f":"Journal!A929","v":0},{"$f":"Journal!B929","v":0},{"$f":"Journal!C929","v":0},{"$f":"Journal!D929","v":0},13,0,0,0,0]
[null,null,null,{"$f":"Journal!A930","v":0},{"$f":"Journal!B930","v":0},{"$f":"Journal!C930","v":0},{"$f":"Journal!D930","v":0},13,0,0,0,0]
[null,null,null,{"$f":"Journal!A931","v":0},{"$f":"Journal!B931","v":0},{"$f":"Journal!C931","v":0},{"$f":"Journal!D931","v":0},13,0,0,0,0]
[null,null,null,{"$f":"Journal!A932","v":0},{"$f":"Journal!B932","v":0},{"$f":"Journal!C932","v":0},{"$f":"Journal!D932","v":0},13,0,0,0,0]
[null,null,null,{"$f":"Journal!A933","v":0},{"$f":"Journal!B933","v":0},{"$f":"Journal!C933","v":0},{"$f":"Journal!D933","v":0},13,0,0,0,0]
[null,null,null,{"$f":"Journal!A934","v":0},{"$f":"Journal!B934","v":0},{"$f":"Journal!C934","v":0},{"$f":"Journal!D934","v":0},13,0,0,0,0]
[null,null,null,{"$f":"Journal!A935","v":0},{"$f":"Journal!B935","v":0},{"$f":"Journal!C935","v":0},{"$f":"Journal!D935","v":0},13,0,0,0,0]
[null,null,null,{"$f":"Journal!A936","v":0},{"$f":"Journal!B936","v":0},{"$f":"Journal!C936","v":0},{"$f":"Journal!D936","v":0},13,0,0,0,0]
[null,null,null,{"$f":"Journal!A937","v":0},{"$f":"Journal!B937","v":0},{"$f":"Journal!C937","v":0},{"$f":"Journal!D937","v":0},13,0,0,0,0]
[null,null,null,{"$f":"Journal!A938","v":0},{"$f":"Journal!B938","v":0},{"$f":"Journal!C938","v":0},{"$f":"Journal!D938","v":0},13,0,0,0,0]
[null,null,null,{"$f":"Journal!A939","v":0},{"$f":"Journal!B939","v":0},{"$f":"Journal!C939","v":0},{"$f":"Journal!D939","v":0},13,0,0,0,0]
[null,null,null,{"$f":"Journal!A940","v":0},{"$f":"Journal!B940","v":0},{"$f":"Journal!C940","v":0},{"$f":"Journal!D940","v":0},13,0,0,0,0]
[null,null,null,{"$f":"Journal!A941","v":0},{"$f":"Journal!B941","v":0},{"$f":"Journal!C941","v":0},{"$f":"Journal!D941","v":0},13,0,0,0,0]
[null,null,null,{"$f":"Journal!A942","v":0},{"$f":"Journal!B942","v":0},{"$f":"Journal!C942","v":0},{"$f":"Journal!D942","v":0},13,0,0,0,0]
[null,null,null,{"$f":"Journal!A943","v":0},{"$f":"Journal!B943","v":0},{"$f":"Journal!C943","v":0},{"$f":"Journal!D943","v":0},13,0,0,0,0]
[null,null,null,{"$f":"Journal!A944","v":0},{"$f":"Journal!B944","v":0},{"$f":"Journal!C944","v":0},{"$f":"Journal!D944","v":0},13,0,0,0,0]
[null,null,null,{"$f":"Journal!A945","v":0},{"$f":"Journal!B945","v":0},{"$f":"Journal!C945","v":0},{"$f":"Journal!D945","v":0},13,0,0,0,0]
[null,null,null,{"$f":"Journal!A946","v":0},{"$f":"Journal!B946","v":0},{"$f":"Journal!C946","v":0},{"$f":"Journal!D946","v":0},13,0,0,0,0]
[null,null,null,{"$f":"Journal!A947","v":0},{"$f":"Journal!B947","v":0},{"$f":"Journal!C947","v":0},{"$f":"Journal!D947","v":0},13,0,0,0,0]
[null,null,null,{"$f":"Journal!A948","v":0},{"$f":"Journal!B948","v":0},{"$f":"Journal!C948","v":0},{"$f":"Journal!D948","v":0},13,0,0,0,0]
[null,null,null,{"$f":"Journal!A949","v":0},{"$f":"Journal!B949","v":0},{"$f":"Journal!C949","v":0},{"$f":"Journal!D949","v":0},13,0,0,0,0]
[null,null,null,{"$f":"Journal!A950","v":0},{"$f":"Journal!B950","v":0},{"$f":"Journal!C950","v":0},{"$f":"Journal!D950","v":0},13,0,0,0,0]
[null,null,null,{"$f":"Journal!A951","v":0},{"$f":"Journal!B951","v":0},{"$f":"Journal!C951","v":0},{"$f":"Journal!D951","v":0},13,0,0,0,0]
[null,null,null,{"$f":"Journal!A952","v":0},{"$f":"Journal!B952","v":0},{"$f":"Journal!C952","v":0},{"$f":"Journal!D952","v":0},13,0,0,0,0]
[null,null,null,{"$f":"Journal!A953","v":0},{"$f":"Journal!B953","v":0},{"$f":"Journal!C953","v":0},{"$f":"Journal!D953","v":0},13,0,0,0,0]
[null,null,null,{"$f":"Journal!A954","v":0},{"$f":"Journal!B954","v":0},{"$f":"Journal!C954","v":0},{"$f":"Journal!D954","v":0},13,0,0,0,0]
[null,null,null,{"$f":"Journal!A955","v":0},{"$f":"Journal!B955","v":0},{"$f":"Journal!C955","v":0},{"$f":"Journal!D955","v":0},13,0,0,0,0]
[null,null,null,{"$f":"Journal!A956","v":0},{"$f":"Journal!B956","v":0},{"$f":"Journal!C956","v":0},{"$f":"Journal!D956","v":0},13,0,0,0,0]
[null,null,null,{"$f":"Journal!A957","v":0},{"$f":"Journal!B957","v":0},{"$f":"Journal!C957","v":0},{"$f":"Journal!D957","v":0},13,0,0,0,0]
[null,null,null,{"$f":"Journal!A958","v":0},{"$f":"Journal!B958","v":0},{"$f":"Journal!C958","v":0},{"$f":"Journal!D958","v":0},13,0,0,0,0]
[null,null,null,{"$f":"Journal!A959","v":0},{"$f":"Journal!B959","v":0},{"$f":"Journal!C959","v":0},{"$f":"Journal!D959","v":0},13,0,0,0,0]
[null,null,null,{"$f":"Journal!A960","v":0},{"$f":"Journal!B960","v":0},{"$f":"Journal!C960","v":0},{"$f":"Journal!D960","v":0},13,0,0,0,0]
[null,null,null,{"$f":"Journal!A961","v":0},{"$f":"Journal!B961","v":0},{"$f":"Journal!C961","v":0},{"$f":"Journal!D961","v":0},13,0,0,0,0]
[null,null,null,{"$f":"Journal!A962","v":0},{"$f":"Journal!B962","v":0},{"$f":"Journal!C962","v":0},{"$f":"Journal!D962","v":0},13,0,0,0,0]
[null,null,null,{"$f":"Journal!A963","v":0},{"$f":"Journal!B963","v":0},{"$f":"Journal!C963","v":0},{"$f":"Journal!D963","v":0},13,0,0,0,0]
[null,null,null,{"$f":"Journal!A964","v":0},{"$f":"Journal!B964","v":0},{"$f":"Journal!C964","v":0},{"$f":"Journal!D964","v":0},13,0,0,0,0]
[null,null,null,{"$f":"Journal!A965","v":0},{"$f":"Journal!B965","v":0},{"$f":"Journal!C965","v":0},{"$f":"Journal!D965","v":0},{"$f":"12-G984+1","v":13},{"$f":"IF(AND(E984=0,F984=0),0,IF(1/F984*2.5>25%,25%,1/F984*2.5))","v":0},{"$f":"E984/5","v":0},{"$f":"IF($E984<410.01,$E984,$E984/$F984/12*$H984)","v":0},{"$f":"IF($E984<410.01,$E984,$E984*I984/1/12*$H984)","v":0}]
[null,null,null,{"$f":"Journal!A966","v":0},{"$f":"Journal!B966","v":0},{"$f":"Journal!C966","v":0},{"$f":"Journal!D966","v":0},13,0,0,0,0]
[null,null,null,{"$f":"Journal!A967","v":0},{"$f":"Journal!B967","v":0},{"$f":"Journal!C967","v":0},{"$f":"Journal!D967","v":0},13,0,0,0,0]
[null,null,null,{"$f":"Journal!A968","v":0},{"$f":"Journal!B968","v":0},{"$f":"Journal!C968","v":0},{"$f":"Journal!D968","v":0},13,0,0,0,0]
[null,null,null,{"$f":"Journal!A969","v":0},{"$f":"Journal!B969","v":0},{"$f":"Journal!C969","v":0},{"$f":"Journal!D969","v":0},13,0,0,0,0]
[null,null,null,{"$f":"Journal!A970","v":0},{"$f":"Journal!B970","v":0},{"$f":"Journal!C970","v":0},{"$f":"Journal!D970","v":0},13,0,0,0,0]
[null,null,null,{"$f":"Journal!A971","v":0},{"$f":"Journal!B971","v":0},{"$f":"Journal!C971","v":0},{"$f":"Journal!D971","v":0},13,0,0,0,0]
[null,null,null,{"$f":"Journal!A972","v":0},{"$f":"Journal!B972","v":0},{"$f":"Journal!C972","v":0},{"$f":"Journal!D972","v":0},13,0,0,0,0]
[null,null,null,{"$f":"Journal!A973","v":0},{"$f":"Journal!B973","v":0},{"$f":"Journal!C973","v":0},{"$f":"Journal!D973","v":0},13,0,0,0,0]
[null,null,null,{"$f":"Journal!A974","v":0},{"$f":"Journal!B974","v":0},{"$f":"Journal!C974","v":0},{"$f":"Journal!D974","v":0},13,0,0,0,0]
[null,null,null,{"$f":"Journal!A975","v":0},{"$f":"Journal!B975","v":0},{"$f":"Journal!C975","v":0},{"$f":"Journal!D975","v":0},13,0,0,0,0]
[null,null,null,{"$f":"Journal!A976","v":0},{"$f":"Journal!B976","v":0},{"$f":"Journal!C976","v":0},{"$f":"Journal!D976","v":0},13,0,0,0,0]
[null,null,null,{"$f":"Journal!A977","v":0},{"$f":"Journal!B977","v":0},{"$f":"Journal!C977","v":0},{"$f":"Journal!D977","v":0},13,0,0,0,0]
[null,null,null,{"$f":"Journal!A978","v":0},{"$f":"Journal!B978","v":0},{"$f":"Journal!C978","v":0},{"$f":"Journal!D978","v":0},13,0,0,0,0]
[null,null,null,{"$f":"Journal!A979","v":0},{"$f":"Journal!B979","v":0},{"$f":"Journal!C979","v":0},{"$f":"Journal!D979","v":0},13,0,0,0,0]
[null,null,null,{"$f":"Journal!A980","v":0},{"$f":"Journal!B980","v":0},{"$f":"Journal!C980","v":0},{"$f":"Journal!D980","v":0},13,0,0,0,0]
[null,null,null,{"$f":"Journal!A981","v":0},{"$f":"Journal!B981","v":0},{"$f":"Journal!C981","v":0},{"$f":"Journal!D981","v":0},13,0,0,0,0]
[null,null,null,{"$f":"Journal!A982","v":0},{"$f":"Journal!B982","v":0},{"$f":"Journal!C982","v":0},{"$f":"Journal!D982","v":0},13,0,0,0,0]
[null,null,null,{"$f":"Journal!A983","v":0},{"$f":"Journal!B983","v":0},{"$f":"Journal!C983","v":0},{"$f":"Journal!D983","v":0},13,0,0,0,0]
[null,null,null,{"$f":"Journal!A984","v":0},{"$f":"Journal!B984","v":0},{"$f":"Journal!C984","v":0},{"$f":"Journal!D984","v":0},13,0,0,0,0]
[null,null,null,{"$f":"Journal!A985","v":0},{"$f":"Journal!B985","v":0},{"$f":"Journal!C985","v":0},{"$f":"Journal!D985","v":0},13,0,0,0,0]
[null,null,null,{"$f":"Journal!A986","v":0},{"$f":"Journal!B986","v":0},{"$f":"Journal!C986","v":0},{"$f":"Journal!D986","v":0},13,0,0,0,0]
[null,null,null,{"$f":"Journal!A987","v":0},{"$f":"Journal!B987","v":0},{"$f":"Journal!C987","v":0},{"$f":"Journal!D987","v":0},13,0,0,0,0]
[null,null,null,{"$f":"Journal!A988","v":0},{"$f":"Journal!B988","v":0},{"$f":"Journal!C988","v":0},{"$f":"Journal!D988","v":0},13,0,0,0,0]
[null,null,null,{"$f":"Journal!A989","v":0},{"$f":"Journal!B989","v":0},{"$f":"Journal!C989","v":0},{"$f":"Journal!D989","v":0},13,0,0,0,0]
[null,null,null,{"$f":"Journal!A990","v":0},{"$f":"Journal!B990","v":0},{"$f":"Journal!C990","v":0},{"$f":"Journal!D990","v":0},13,0,0,0,0]
[null,null,null,{"$f":"Journal!A991","v":0},{"$f":"Journal!B991","v":0},{"$f":"Journal!C991","v":0},{"$f":"Journal!D991","v":0},13,0,0,0,0]
[null,null,null,{"$f":"Journal!A992","v":0},{"$f":"Journal!B992","v":0},{"$f":"Journal!C992","v":0},{"$f":"Journal!D992","v":0},13,0,0,0,0]
[null,null,null,{"$f":"Journal!A993","v":0},{"$f":"Journal!B993","v":0},{"$f":"Journal!C993","v":0},{"$f":"Journal!D993","v":0},13,0,0,0,0]
[null,null,null,{"$f":"Journal!A994","v":0},{"$f":"Journal!B994","v":0},{"$f":"Journal!C994","v":0},{"$f":"Journal!D994","v":0},13,0,0,0,0]
[null,null,null,{"$f":"Journal!A995","v":0},{"$f":"Journal!B995","v":0},{"$f":"Journal!C995","v":0},{"$f":"Journal!D995","v":0},13,0,0,0,0]
[null,null,null,{"$f":"Journal!A996","v":0},{"$f":"Journal!B996","v":0},{"$f":"Journal!C996","v":0},{"$f":"Journal!D996","v":0},13,0,0,0,0]
[null,null,null,{"$f":"Journal!A997","v":0},{"$f":"Journal!B997","v":0},{"$f":"Journal!C997","v":0},{"$f":"Journal!D997","v":0},13,0,0,0,0]
[null,null,null,{"$f":"Journal!A998","v":0},{"$f":"Journal!B998","v":0},{"$f":"Journal!C998","v":0},{"$f":"Journal!D998","v":0},13,0,0,0,0]
[null,null,null,{"$f":"Journal!A999","v":0},{"$f":"Journal!B999","v":0},{"$f":"Journal!C999","v":0},{"$f":"Journal!D999","v":0},13,0,0,0,0]
[null,null,null,{"$f":"Journal!A1000","v":0},{"$f":"Journal!B1000","v":0},{"$f":"Journal!C1000","v":0},{"$f":"Journal!D1000","v":0},13,0,0,0,0]
[null,null,null,{"$f":"Journal!A1001","v":0},{"$f":"Journal!B1001","v":0},{"$f":"Journal!C1001","v":0},{"$f":"Journal!D1001","v":0},13,0,0,0,0]
[null,null,null,{"$f":"Journal!A1002","v":0},{"$f":"Journal!B1002","v":0},{"$f":"Journal!C1002","v":0},{"$f":"Journal!D1002","v":0},13,0,0,0,0]
[null,null,null,{"$f":"Journal!A1003","v":0},{"$f":"Journal!B1003","v":0},{"$f":"Journal!C1003","v":0},{"$f":"Journal!D1003","v":0},13,0,0,0,0]
[null,null,null,{"$f":"Journal!A1004","v":0},{"$f":"Journal!B1004","v":0},{"$f":"Journal!C1004","v":0},{"$f":"Journal!D1004","v":0},13,0,0,0,0]
[null,null,null,{"$f":"Journal!A1005","v":0},{"$f":"Journal!B1005","v":0},{"$f":"Journal!C1005","v":0},{"$f":"Journal!D1005","v":0},13,0,0,0,0]
[null,null,null,{"$f":"Journal!A1006","v":0},{"$f":"Journal!B1006","v":0},{"$f":"Journal!C1006","v":0},{"$f":"Journal!D1006","v":0},13,0,0,0,0]
[null,null,null,{"$f":"Journal!A1007","v":0},{"$f":"Journal!B1007","v":0},{"$f":"Journal!C1007","v":0},{"$f":"Journal!D1007","v":0},13,0,0,0,0]
[null,null,null,{"$f":"Journal!A1008","v":0},{"$f":"Journal!B1008","v":0},{"$f":"Journal!C1008","v":0},{"$f":"Journal!D1008","v":0},13,0,0,0,0]
[null,null,null,{"$f":"Journal!A1009","v":0},{"$f":"Journal!B1009","v":0},{"$f":"Journal!C1009","v":0},{"$f":"Journal!D1009","v":0},13,0,0,0,0]
[null,null,null,{"$f":"Journal!A1010","v":0},{"$f":"Journal!B1010","v":0},{"$f":"Journal!C1010","v":0},{"$f":"Journal!D1010","v":0},13,0,0,0,0]
[null,null,null,{"$f":"Journal!A1011","v":0},{"$f":"Journal!B1011","v":0},{"$f":"Journal!C1011","v":0},{"$f":"Journal!D1011","v":0},13,0,0,0,0]
[null,null,null,{"$f":"Journal!A1012","v":0},{"$f":"Journal!B1012","v":0},{"$f":"Journal!C1012","v":0},{"$f":"Journal!D1012","v":0},13,0,0,0,0]
[null,null,null,{"$f":"Journal!A1013","v":0},{"$f":"Journal!B1013","v":0},{"$f":"Journal!C1013","v":0},{"$f":"Journal!D1013","v":0},13,0,0,0,0]
[null,null,null,{"$f":"Journal!A1014","v":0},{"$f":"Journal!B1014","v":0},{"$f":"Journal!C1014","v":0},{"$f":"Journal!D1014","v":0},13,0,0,0,0]
[null,null,null,{"$f":"Journal!A1015","v":0},{"$f":"Journal!B1015","v":0},{"$f":"Journal!C1015","v":0},{"$f":"Journal!D1015","v":0},13,0,0,0,0]
[null,null,null,{"$f":"Journal!A1016","v":0},{"$f":"Journal!B1016","v":0},{"$f":"Journal!C1016","v":0},{"$f":"Journal!D1016","v":0},13,0,0,0,0]
[null,null,null,{"$f":"Journal!A1017","v":0},{"$f":"Journal!B1017","v":0},{"$f":"Journal!C1017","v":0},{"$f":"Journal!D1017","v":0},13,0,0,0,0]
[null,null,null,{"$f":"Journal!A1018","v":0},{"$f":"Journal!B1018","v":0},{"$f":"Journal!C1018","v":0},{"$f":"Journal!D1018","v":0},13,0,0,0,0]
[null,null,null,{"$f":"Journal!A1019","v":0},{"$f":"Journal!B1019","v":0},{"$f":"Journal!C1019","v":0},{"$f":"Journal!D1019","v":0},13,0,0,0,0]
[null,null,null,{"$f":"Journal!A1020","v":0},{"$f":"Journal!B1020","v":0},{"$f":"Journal!C1020","v":0},{"$f":"Journal!D1020","v":0},13,0,0,0,0]
[null,null,null,{"$f":"Journal!A1021","v":0},{"$f":"Journal!B1021","v":0},{"$f":"Journal!C1021","v":0},{"$f":"Journal!D1021","v":0},13,0,0,0,0]
[null,null,null,{"$f":"Journal!A1022","v":0},{"$f":"Journal!B1022","v":0},{"$f":"Journal!C1022","v":0},{"$f":"Journal!D1022","v":0},13,0,0,0,0]
[null,null,null,{"$f":"Journal!A1023","v":0},{"$f":"Journal!B1023","v":0},{"$f":"Journal!C1023","v":0},{"$f":"Journal!D1023","v":0},13,0,0,0,0]
[null,null,null,{"$f":"Journal!A1024","v":0},{"$f":"Journal!B1024","v":0},{"$f":"Journal!C1024","v":0},{"$f":"Journal!D1024","v":0},13,0,0,0,0]
[null,null,null,{"$f":"Journal!A1025","v":0},{"$f":"Journal!B1025","v":0},{"$f":"Journal!C1025","v":0},{"$f":"Journal!D1025","v":0},13,0,0,0,0]
[null,null,null,{"$f":"Journal!A1026","v":0},{"$f":"Journal!B1026","v":0},{"$f":"Journal!C1026","v":0},{"$f":"Journal!D1026","v":0},13,0,0,0,0]
[null,null,null,{"$f":"Journal!A1027","v":0},{"$f":"Journal!B1027","v":0},{"$f":"Journal!C1027","v":0},{"$f":"Journal!D1027","v":0},13,0,0,0,0]
[null,null,null,{"$f":"Journal!A1028","v":0},{"$f":"Journal!B1028","v":0},{"$f":"Journal!C1028","v":0},{"$f":"Journal!D1028","v":0},13,0,0,0,0]
[null,null,null,{"$f":"Journal!A1029","v":0},{"$f":"Journal!B1029","v":0},{"$f":"Journal!C1029","v":0},{"$f":"Journal!D1029","v":0},{"$f":"12-G1048+1","v":13},{"$f":"IF(AND(E1048=0,F1048=0),0,IF(1/F1048*2.5>25%,25%,1/F1048*2.5))","v":0},{"$f":"E1048/5","v":0},{"$f":"IF($E1048<410.01,$E1048,$E1048/$F1048/12*$H1048)","v":0},{"$f":"IF($E1048<410.01,$E1048,$E1048*I1048/1/12*$H1048)","v":0}]
[null,null,null,{"$f":"Journal!A1030","v":0},{"$f":"Journal!B1030","v":0},{"$f":"Journal!C1030","v":0},{"$f":"Journal!D1030","v":0},13,0,0,0,0]
[null,null,null,{"$f":"Journal!A1031","v":0},{"$f":"Journal!B1031","v":0},{"$f":"Journal!C1031","v":0},{"$f":"Journal!D1031","v":0},13,0,0,0,0]
[null,null,null,{"$f":"Journal!A1032","v":0},{"$f":"Journal!B1032","v":0},{"$f":"Journal!C1032","v":0},{"$f":"Journal!D1032","v":0},13,0,0,0,0]
[null,null,null,{"$f":"Journal!A1033","v":0},{"$f":"Journal!B1033","v":0},{"$f":"Journal!C1033","v":0},{"$f":"Journal!D1033","v":0},13,0,0,0,0]
[null,null,null,{"$f":"Journal!A1034","v":0},{"$f":"Journal!B1034","v":0},{"$f":"Journal!C1034","v":0},{"$f":"Journal!D1034","v":0},13,0,0,0,0]
[null,null,null,{"$f":"Journal!A1035","v":0},{"$f":"Journal!B1035","v":0},{"$f":"Journal!C1035","v":0},{"$f":"Journal!D1035","v":0},13,0,0,0,0]
[null,null,null,{"$f":"Journal!A1036","v":0},{"$f":"Journal!B1036","v":0},{"$f":"Journal!C1036","v":0},{"$f":"Journal!D1036","v":0},13,0,0,0,0]
[null,null,null,{"$f":"Journal!A1037","v":0},{"$f":"Journal!B1037","v":0},{"$f":"Journal!C1037","v":0},{"$f":"Journal!D1037","v":0},13,0,0,0,0]
[null,null,null,{"$f":"Journal!A1038","v":0},{"$f":"Journal!B1038","v":0},{"$f":"Journal!C1038","v":0},{"$f":"Journal!D1038","v":0},13,0,0,0,0]
[null,null,null,{"$f":"Journal!A1039","v":0},{"$f":"Journal!B1039","v":0},{"$f":"Journal!C1039","v":0},{"$f":"Journal!D1039","v":0},13,0,0,0,0]
[null,null,null,{"$f":"Journal!A1040","v":0},{"$f":"Journal!B1040","v":0},{"$f":"Journal!C1040","v":0},{"$f":"Journal!D1040","v":0},13,0,0,0,0]
[null,null,null,{"$f":"Journal!A1041","v":0},{"$f":"Journal!B1041","v":0},{"$f":"Journal!C1041","v":0},{"$f":"Journal!D1041","v":0},13,0,0,0,0]
[null,null,null,{"$f":"Journal!A1042","v":0},{"$f":"Journal!B1042","v":0},{"$f":"Journal!C1042","v":0},{"$f":"Journal!D1042","v":0},13,0,0,0,0]
[null,null,null,{"$f":"Journal!A1043","v":0},{"$f":"Journal!B1043","v":0},{"$f":"Journal!C1043","v":0},{"$f":"Journal!D1043","v":0},13,0,0,0,0]
[null,null,null,{"$f":"Journal!A1044","v":0},{"$f":"Journal!B1044","v":0},{"$f":"Journal!C1044","v":0},{"$f":"Journal!D1044","v":0},13,0,0,0,0]
[null,null,null,{"$f":"Journal!A1045","v":0},{"$f":"Journal!B1045","v":0},{"$f":"Journal!C1045","v":0},{"$f":"Journal!D1045","v":0},13,0,0,0,0]
[null,null,null,{"$f":"Journal!A1046","v":0},{"$f":"Journal!B1046","v":0},{"$f":"Journal!C1046","v":0},{"$f":"Journal!D1046","v":0},13,0,0,0,0]
[null,null,null,{"$f":"Journal!A1047","v":0},{"$f":"Journal!B1047","v":0},{"$f":"Journal!C1047","v":0},{"$f":"Journal!D1047","v":0},13,0,0,0,0]
[null,null,null,{"$f":"Journal!A1048","v":0},{"$f":"Journal!B1048","v":0},{"$f":"Journal!C1048","v":0},{"$f":"Journal!D1048","v":0},13,0,0,0,0]
[null,null,null,{"$f":"Journal!A1049","v":0},{"$f":"Journal!B1049","v":0},{"$f":"Journal!C1049","v":0},{"$f":"Journal!D1049","v":0},13,0,0,0,0]
[null,null,null,{"$f":"Journal!A1050","v":0},{"$f":"Journal!B1050","v":0},{"$f":"Journal!C1050","v":0},{"$f":"Journal!D1050","v":0},13,0,0,0,0]
[null,null,null,{"$f":"Journal!A1051","v":0},{"$f":"Journal!B1051","v":0},{"$f":"Journal!C1051","v":0},{"$f":"Journal!D1051","v":0},13,0,0,0,0]
[null,null,null,{"$f":"Journal!A1052","v":0},{"$f":"Journal!B1052","v":0},{"$f":"Journal!C1052","v":0},{"$f":"Journal!D1052","v":0},13,0,0,0,0]
[null,null,null,{"$f":"Journal!A1053","v":0},{"$f":"Journal!B1053","v":0},{"$f":"Journal!C1053","v":0},{"$f":"Journal!D1053","v":0},13,0,0,0,0]
[null,null,null,{"$f":"Journal!A1054","v":0},{"$f":"Journal!B1054","v":0},{"$f":"Journal!C1054","v":0},{"$f":"Journal!D1054","v":0},13,0,0,0,0]
[null,null,null,{"$f":"Journal!A1055","v":0},{"$f":"Journal!B1055","v":0},{"$f":"Journal!C1055","v":0},{"$f":"Journal!D1055","v":0},13,0,0,0,0]
[null,null,null,{"$f":"Journal!A1056","v":0},{"$f":"Journal!B1056","v":0},{"$f":"Journal!C1056","v":0},{"$f":"Journal!D1056","v":0},13,0,0,0,0]
[null,null,null,{"$f":"Journal!A1057","v":0},{"$f":"Journal!B1057","v":0},{"$f":"Journal!C1057","v":0},{"$f":"Journal!D1057","v":0},13,0,0,0,0]
[null,null,null,{"$f":"Journal!A1058","v":0},{"$f":"Journal!B1058","v":0},{"$f":"Journal!C1058","v":0},{"$f":"Journal!D1058","v":0},13,0,0,0,0]
[null,null,null,{"$f":"Journal!A1059","v":0},{"$f":"Journal!B1059","v":0},{"$f":"Journal!C1059","v":0},{"$f":"Journal!D1059","v":0},13,0,0,0,0]
[null,null,null,{"$f":"Journal!A1060","v":0},{"$f":"Journal!B1060","v":0},{"$f":"Journal!C1060","v":0},{"$f":"Journal!D1060","v":0},13,0,0,0,0]
[null,null,null,{"$f":"Journal!A1061","v":0},{"$f":"Journal!B1061","v":0},{"$f":"Journal!C1061","v":0},{"$f":"Journal!D1061","v":0},13,0,0,0,0]
[null,null,null,{"$f":"Journal!A1062","v":0},{"$f":"Journal!B1062","v":0},{"$f":"Journal!C1062","v":0},{"$f":"Journal!D1062","v":0},13,0,0,0,0]
[null,null,null,{"$f":"Journal!A1063","v":0},{"$f":"Journal!B1063","v":0},{"$f":"Journal!C1063","v":0},{"$f":"Journal!D1063","v":0},13,0,0,0,0]
[null,null,null,{"$f":"Journal!A1064","v":0},{"$f":"Journal!B1064","v":0},{"$f":"Journal!C1064","v":0},{"$f":"Journal!D1064","v":0},13,0,0,0,0]
[null,null,null,{"$f":"Journal!A1065","v":0},{"$f":"Journal!B1065","v":0},{"$f":"Journal!C1065","v":0},{"$f":"Journal!D1065","v":0},13,0,0,0,0]
[null,null,null,{"$f":"Journal!A1066","v":0},{"$f":"Journal!B1066","v":0},{"$f":"Journal!C1066","v":0},{"$f":"Journal!D1066","v":0},13,0,0,0,0]
[null,null,null,{"$f":"Journal!A1067","v":0},{"$f":"Journal!B1067","v":0},{"$f":"Journal!C1067","v":0},{"$f":"Journal!D1067","v":0},13,0,0,0,0]
[null,null,null,{"$f":"Journal!A1068","v":0},{"$f":"Journal!B1068","v":0},{"$f":"Journal!C1068","v":0},{"$f":"Journal!D1068","v":0},13,0,0,0,0]
[null,null,null,{"$f":"Journal!A1069","v":0},{"$f":"Journal!B1069","v":0},{"$f":"Journal!C1069","v":0},{"$f":"Journal!D1069","v":0},13,0,0,0,0]
[null,null,null,{"$f":"Journal!A1070","v":0},{"$f":"Journal!B1070","v":0},{"$f":"Journal!C1070","v":0},{"$f":"Journal!D1070","v":0},13,0,0,0,0]
[null,null,null,{"$f":"Journal!A1071","v":0},{"$f":"Journal!B1071","v":0},{"$f":"Journal!C1071","v":0},{"$f":"Journal!D1071","v":0},13,0,0,0,0]
[null,null,null,{"$f":"Journal!A1072","v":0},{"$f":"Journal!B1072","v":0},{"$f":"Journal!C1072","v":0},{"$f":"Journal!D1072","v":0},13,0,0,0,0]
[null,null,null,{"$f":"Journal!A1073","v":0},{"$f":"Journal!B1073","v":0},{"$f":"Journal!C1073","v":0},{"$f":"Journal!D1073","v":0},13,0,0,0,0]
[null,null,null,{"$f":"Journal!A1074","v":0},{"$f":"Journal!B1074","v":0},{"$f":"Journal!C1074","v":0},{"$f":"Journal!D1074","v":0},13,0,0,0,0]
[null,null,null,{"$f":"Journal!A1075","v":0},{"$f":"Journal!B1075","v":0},{"$f":"Journal!C1075","v":0},{"$f":"Journal!D1075","v":0},13,0,0,0,0]
[null,null,null,{"$f":"Journal!A1076","v":0},{"$f":"Journal!B1076","v":0},{"$f":"Journal!C1076","v":0},{"$f":"Journal!D1076","v":0},13,0,0,0,0]
[null,null,null,{"$f":"Journal!A1077","v":0},{"$f":"Journal!B1077","v":0},{"$f":"Journal!C1077","v":0},{"$f":"Journal!D1077","v":0},13,0,0,0,0]
[null,null,null,{"$f":"Journal!A1078","v":0},{"$f":"Journal!B1078","v":0},{"$f":"Journal!C1078","v":0},{"$f":"Journal!D1078","v":0},13,0,0,0,0]
[null,null,null,{"$f":"Journal!A1079","v":0},{"$f":"Journal!B1079","v":0},{"$f":"Journal!C1079","v":0},{"$f":"Journal!D1079","v":0},13,0,0,0,0]
[null,null,null,{"$f":"Journal!A1080","v":0},{"$f":"Journal!B1080","v":0},{"$f":"Journal!C1080","v":0},{"$f":"Journal!D1080","v":0},13,0,0,0,0]
[null,null,null,{"$f":"Journal!A1081","v":0},{"$f":"Journal!B1081","v":0},{"$f":"Journal!C1081","v":0},{"$f":"Journal!D1081","v":0},13,0,0,0,0]
[null,null,null,{"$f":"Journal!A1082","v":0},{"$f":"Journal!B1082","v":0},{"$f":"Journal!C1082","v":0},{"$f":"Journal!D1082","v":0},13,0,0,0,0]
[null,null,null,{"$f":"Journal!A1083","v":0},{"$f":"Journal!B1083","v":0},{"$f":"Journal!C1083","v":0},{"$f":"Journal!D1083","v":0},13,0,0,0,0]
[null,null,null,{"$f":"Journal!A1084","v":0},{"$f":"Journal!B1084","v":0},{"$f":"Journal!C1084","v":0},{"$f":"Journal!D1084","v":0},13,0,0,0,0]
[null,null,null,{"$f":"Journal!A1085","v":0},{"$f":"Journal!B1085","v":0},{"$f":"Journal!C1085","v":0},{"$f":"Journal!D1085","v":0},13,0,0,0,0]
[null,null,null,{"$f":"Journal!A1086","v":0},{"$f":"Journal!B1086","v":0},{"$f":"Journal!C1086","v":0},{"$f":"Journal!D1086","v":0},13,0,0,0,0]
[null,null,null,{"$f":"Journal!A1087","v":0},{"$f":"Journal!B1087","v":0},{"$f":"Journal!C1087","v":0},{"$f":"Journal!D1087","v":0},13,0,0,0,0]
[null,null,null,{"$f":"Journal!A1088","v":0},{"$f":"Journal!B1088","v":0},{"$f":"Journal!C1088","v":0},{"$f":"Journal!D1088","v":0},13,0,0,0,0]
[null,null,null,{"$f":"Journal!A1089","v":0},{"$f":"Journal!B1089","v":0},{"$f":"Journal!C1089","v":0},{"$f":"Journal!D1089","v":0},13,0,0,0,0]
[null,null,null,{"$f":"Journal!A1090","v":0},{"$f":"Journal!B1090","v":0},{"$f":"Journal!C1090","v":0},{"$f":"Journal!D1090","v":0},13,0,0,0,0]
[null,null,null,{"$f":"Journal!A1091","v":0},{"$f":"Journal!B1091","v":0},{"$f":"Journal!C1091","v":0},{"$f":"Journal!D1091","v":0},13,0,0,0,0]
[null,null,null,{"$f":"Journal!A1092","v":0},{"$f":"Journal!B1092","v":0},{"$f":"Journal!C1092","v":0},{"$f":"Journal!D1092","v":0},13,0,0,0,0]
[null,null,null,{"$f":"Journal!A1093","v":0},{"$f":"Journal!B1093","v":0},{"$f":"Journal!C1093","v":0},{"$f":"Journal!D1093","v":0},{"$f":"12-G1112+1","v":13},{"$f":"IF(AND(E1112=0,F1112=0),0,IF(1/F1112*2.5>25%,25%,1/F1112*2.5))","v":0},{"$f":"E1112/5","v":0},{"$f":"IF($E1112<410.01,$E1112,$E1112/$F1112/12*$H1112)","v":0},{"$f":"IF($E1112<410.01,$E1112,$E1112*I1112/1/12*$H1112)","v":0}]
[null,null,null,{"$f":"Journal!A1094","v":0},{"$f":"Journal!B1094","v":0},{"$f":"Journal!C1094","v":0},{"$f":"Journal!D1094","v":0},13,0,0,0,0]
[null,null,null,{"$f":"Journal!A1095","v":0},{"$f":"Journal!B1095","v":0},{"$f":"Journal!C1095","v":0},{"$f":"Journal!D1095","v":0},13,0,0,0,0]
[null,null,null,{"$f":"Journal!A1096","v":0},{"$f":"Journal!B1096","v":0},{"$f":"Journal!C1096","v":0},{"$f":"Journal!D1096","v":0},13,0,0,0,0]
[null,null,null,{"$f":"Journal!A1097","v":0},{"$f":"Journal!B1097","v":0},{"$f":"Journal!C1097","v":0},{"$f":"Journal!D1097","v":0},13,0,0,0,0]
[null,null,null,{"$f":"Journal!A1098","v":0},{"$f":"Journal!B1098","v":0},{"$f":"Journal!C1098","v":0},{"$f":"Journal!D1098","v":0},13,0,0,0,0]
[null,null,null,{"$f":"Journal!A1099","v":0},{"$f":"Journal!B1099","v":0},{"$f":"Journal!C1099","v":0},{"$f":"Journal!D1099","v":0},13,0,0,0,0]
[null,null,null,{"$f":"Journal!A1100","v":0},{"$f":"Journal!B1100","v":0},{"$f":"Journal!C1100","v":0},{"$f":"Journal!D1100","v":0},13,0,0,0,0]
[null,null,null,{"$f":"Journal!A1101","v":0},{"$f":"Journal!B1101","v":0},{"$f":"Journal!C1101","v":0},{"$f":"Journal!D1101","v":0},13,0,0,0,0]
[null,null,null,{"$f":"Journal!A1102","v":0},{"$f":"Journal!B1102","v":0},{"$f":"Journal!C1102","v":0},{"$f":"Journal!D1102","v":0},13,0,0,0,0]
[null,null,null,{"$f":"Journal!A1103","v":0},{"$f":"Journal!B1103","v":0},{"$f":"Journal!C1103","v":0},{"$f":"Journal!D1103","v":0},13,0,0,0,0]
[null,null,null,{"$f":"Journal!A1104","v":0},{"$f":"Journal!B1104","v":0},{"$f":"Journal!C1104","v":0},{"$f":"Journal!D1104","v":0},13,0,0,0,0]
[null,null,null,{"$f":"Journal!A1105","v":0},{"$f":"Journal!B1105","v":0},{"$f":"Journal!C1105","v":0},{"$f":"Journal!D1105","v":0},13,0,0,0,0]
[null,null,null,{"$f":"Journal!A1106","v":0},{"$f":"Journal!B1106","v":0},{"$f":"Journal!C1106","v":0},{"$f":"Journal!D1106","v":0},13,0,0,0,0]
[null,null,null,{"$f":"Journal!A1107","v":0},{"$f":"Journal!B1107","v":0},{"$f":"Journal!C1107","v":0},{"$f":"Journal!D1107","v":0},13,0,0,0,0]
[null,null,null,{"$f":"Journal!A1108","v":0},{"$f":"Journal!B1108","v":0},{"$f":"Journal!C1108","v":0},{"$f":"Journal!D1108","v":0},13,0,0,0,0]
[null,null,null,{"$f":"Journal!A1109","v":0},{"$f":"Journal!B1109","v":0},{"$f":"Journal!C1109","v":0},{"$f":"Journal!D1109","v":0},13,0,0,0,0]
[null,null,null,{"$f":"Journal!A1110","v":0},{"$f":"Journal!B1110","v":0},{"$f":"Journal!C1110","v":0},{"$f":"Journal!D1110","v":0},13,0,0,0,0]
[null,null,null,{"$f":"Journal!A1111","v":0},{"$f":"Journal!B1111","v":0},{"$f":"Journal!C1111","v":0},{"$f":"Journal!D1111","v":0},13,0,0,0,0]
[null,null,null,{"$f":"Journal!A1112","v":0},{"$f":"Journal!B1112","v":0},{"$f":"Journal!C1112","v":0},{"$f":"Journal!D1112","v":0},13,0,0,0,0]
[null,null,null,{"$f":"Journal!A1113","v":0},{"$f":"Journal!B1113","v":0},{"$f":"Journal!C1113","v":0},{"$f":"Journal!D1113","v":0},13,0,0,0,0]
[null,null,null,{"$f":"Journal!A1114","v":0},{"$f":"Journal!B1114","v":0},{"$f":"Journal!C1114","v":0},{"$f":"Journal!D1114","v":0},13,0,0,0,0]
[null,null,null,{"$f":"Journal!A1115","v":0},{"$f":"Journal!B1115","v":0},{"$f":"Journal!C1115","v":0},{"$f":"Journal!D1115","v":0},13,0,0,0,0]
[null,null,null,{"$f":"Journal!A1116","v":0},{"$f":"Journal!B1116","v":0},{"$f":"Journal!C1116","v":0},{"$f":"Journal!D1116","v":0},13,0,0,0,0]
[null,null,null,{"$f":"Journal!A1117","v":0},{"$f":"Journal!B1117","v":0},{"$f":"Journal!C1117","v":0},{"$f":"Journal!D1117","v":0},13,0,0,0,0]
[null,null,null,{"$f":"Journal!A1118","v":0},{"$f":"Journal!B1118","v":0},{"$f":"Journal!C1118","v":0},{"$f":"Journal!D1118","v":0},13,0,0,0,0]
[null,null,null,{"$f":"Journal!A1119","v":0},{"$f":"Journal!B1119","v":0},{"$f":"Journal!C1119","v":0},{"$f":"Journal!D1119","v":0},13,0,0,0,0]
[null,null,null,{"$f":"Journal!A1120","v":0},{"$f":"Journal!B1120","v":0},{"$f":"Journal!C1120","v":0},{"$f":"Journal!D1120","v":0},13,0,0,0,0]
[null,null,null,{"$f":"Journal!A1121","v":0},{"$f":"Journal!B1121","v":0},{"$f":"Journal!C1121","v":0},{"$f":"Journal!D1121","v":0},13,0,0,0,0]
[null,null,null,{"$f":"Journal!A1122","v":0},{"$f":"Journal!B1122","v":0},{"$f":"Journal!C1122","v":0},{"$f":"Journal!D1122","v":0},13,0,0,0,0]
[null,null,null,{"$f":"Journal!A1123","v":0},{"$f":"Journal!B1123","v":0},{"$f":"Journal!C1123","v":0},{"$f":"Journal!D1123","v":0},13,0,0,0,0]
[null,null,null,{"$f":"Journal!A1124","v":0},{"$f":"Journal!B1124","v":0},{"$f":"Journal!C1124","v":0},{"$f":"Journal!D1124","v":0},13,0,0,0,0]
[null,null,null,{"$f":"Journal!A1125","v":0},{"$f":"Journal!B1125","v":0},{"$f":"Journal!C1125","v":0},{"$f":"Journal!D1125","v":0},13,0,0,0,0]
[null,null,null,{"$f":"Journal!A1126","v":0},{"$f":"Journal!B1126","v":0},{"$f":"Journal!C1126","v":0},{"$f":"Journal!D1126","v":0},13,0,0,0,0]
[null,null,null,{"$f":"Journal!A1127","v":0},{"$f":"Journal!B1127","v":0},{"$f":"Journal!C1127","v":0},{"$f":"Journal!D1127","v":0},13,0,0,0,0]
[null,null,null,{"$f":"Journal!A1128","v":0},{"$f":"Journal!B1128","v":0},{"$f":"Journal!C1128","v":0},{"$f":"Journal!D1128","v":0},13,0,0,0,0]
[null,null,null,{"$f":"Journal!A1129","v":0},{"$f":"Journal!B1129","v":0},{"$f":"Journal!C1129","v":0},{"$f":"Journal!D1129","v":0},13,0,0,0,0]
[null,null,null,{"$f":"Journal!A1130","v":0},{"$f":"Journal!B1130","v":0},{"$f":"Journal!C1130","v":0},{"$f":"Journal!D1130","v":0},13,0,0,0,0]
[null,null,null,{"$f":"Journal!A1131","v":0},{"$f":"Journal!B1131","v":0},{"$f":"Journal!C1131","v":0},{"$f":"Journal!D1131","v":0},13,0,0,0,0]
[null,null,null,{"$f":"Journal!A1132","v":0},{"$f":"Journal!B1132","v":0},{"$f":"Journal!C1132","v":0},{"$f":"Journal!D1132","v":0},13,0,0,0,0]
[null,null,null,{"$f":"Journal!A1133","v":0},{"$f":"Journal!B1133","v":0},{"$f":"Journal!C1133","v":0},{"$f":"Journal!D1133","v":0},13,0,0,0,0]
[null,null,null,{"$f":"Journal!A1134","v":0},{"$f":"Journal!B1134","v":0},{"$f":"Journal!C1134","v":0},{"$f":"Journal!D1134","v":0},13,0,0,0,0]
[null,null,null,{"$f":"Journal!A1135","v":0},{"$f":"Journal!B1135","v":0},{"$f":"Journal!C1135","v":0},{"$f":"Journal!D1135","v":0},13,0,0,0,0]
[null,null,null,{"$f":"Journal!A1136","v":0},{"$f":"Journal!B1136","v":0},{"$f":"Journal!C1136","v":0},{"$f":"Journal!D1136","v":0},13,0,0,0,0]
[null,null,null,{"$f":"Journal!A1137","v":0},{"$f":"Journal!B1137","v":0},{"$f":"Journal!C1137","v":0},{"$f":"Journal!D1137","v":0},13,0,0,0,0]
[null,null,null,{"$f":"Journal!A1138","v":0},{"$f":"Journal!B1138","v":0},{"$f":"Journal!C1138","v":0},{"$f":"Journal!D1138","v":0},13,0,0,0,0]
[null,null,null,{"$f":"Journal!A1139","v":0},{"$f":"Journal!B1139","v":0},{"$f":"Journal!C1139","v":0},{"$f":"Journal!D1139","v":0},13,0,0,0,0]
[null,null,null,{"$f":"Journal!A1140","v":0},{"$f":"Journal!B1140","v":0},{"$f":"Journal!C1140","v":0},{"$f":"Journal!D1140","v":0},13,0,0,0,0]
[null,null,null,{"$f":"Journal!A1141","v":0},{"$f":"Journal!B1141","v":0},{"$f":"Journal!C1141","v":0},{"$f":"Journal!D1141","v":0},13,0,0,0,0]
[null,null,null,{"$f":"Journal!A1142","v":0},{"$f":"Journal!B1142","v":0},{"$f":"Journal!C1142","v":0},{"$f":"Journal!D1142","v":0},13,0,0,0,0]
[null,null,null,{"$f":"Journal!A1143","v":0},{"$f":"Journal!B1143","v":0},{"$f":"Journal!C1143","v":0},{"$f":"Journal!D1143","v":0},13,0,0,0,0]
[null,null,null,{"$f":"Journal!A1144","v":0},{"$f":"Journal!B1144","v":0},{"$f":"Journal!C1144","v":0},{"$f":"Journal!D1144","v":0},13,0,0,0,0]
[null,null,null,{"$f":"Journal!A1145","v":0},{"$f":"Journal!B1145","v":0},{"$f":"Journal!C1145","v":0},{"$f":"Journal!D1145","v":0},13,0,0,0,0]
[null,null,null,{"$f":"Journal!A1146","v":0},{"$f":"Journal!B1146","v":0},{"$f":"Journal!C1146","v":0},{"$f":"Journal!D1146","v":0},13,0,0,0,0]
[null,null,null,{"$f":"Journal!A1147","v":0},{"$f":"Journal!B1147","v":0},{"$f":"Journal!C1147","v":0},{"$f":"Journal!D1147","v":0},13,0,0,0,0]
[null,null,null,{"$f":"Journal!A1148","v":0},{"$f":"Journal!B1148","v":0},{"$f":"Journal!C1148","v":0},{"$f":"Journal!D1148","v":0},13,0,0,0,0]
[null,null,null,{"$f":"Journal!A1149","v":0},{"$f":"Journal!B1149","v":0},{"$f":"Journal!C1149","v":0},{"$f":"Journal!D1149","v":0},13,0,0,0,0]
[null,null,null,{"$f":"Journal!A1150","v":0},{"$f":"Journal!B1150","v":0},{"$f":"Journal!C1150","v":0},{"$f":"Journal!D1150","v":0},13,0,0,0,0]
[null,null,null,{"$f":"Journal!A1151","v":0},{"$f":"Journal!B1151","v":0},{"$f":"Journal!C1151","v":0},{"$f":"Journal!D1151","v":0},13,0,0,0,0]
[null,null,null,{"$f":"Journal!A1152","v":0},{"$f":"Journal!B1152","v":0},{"$f":"Journal!C1152","v":0},{"$f":"Journal!D1152","v":0},13,0,0,0,0]
[null,null,null,{"$f":"Journal!A1153","v":0},{"$f":"Journal!B1153","v":0},{"$f":"Journal!C1153","v":0},{"$f":"Journal!D1153","v":0},13,0,0,0,0]
[null,null,null,{"$f":"Journal!A1154","v":0},{"$f":"Journal!B1154","v":0},{"$f":"Journal!C1154","v":0},{"$f":"Journal!D1154","v":0},13,0,0,0,0]
[null,null,null,{"$f":"Journal!A1155","v":0},{"$f":"Journal!B1155","v":0},{"$f":"Journal!C1155","v":0},{"$f":"Journal!D1155","v":0},13,0,0,0,0]
[null,null,null,{"$f":"Journal!A1156","v":0},{"$f":"Journal!B1156","v":0},{"$f":"Journal!C1156","v":0},{"$f":"Journal!D1156","v":0},13,0,0,0,0]
[null,null,null,{"$f":"Journal!A1157","v":0},{"$f":"Journal!B1157","v":0},{"$f":"Journal!C1157","v":0},{"$f":"Journal!D1157","v":0},{"$f":"12-G1176+1","v":13},{"$f":"IF(AND(E1176=0,F1176=0),0,IF(1/F1176*2.5>25%,25%,1/F1176*2.5))","v":0},{"$f":"E1176/5","v":0},{"$f":"IF($E1176<410.01,$E1176,$E1176/$F1176/12*$H1176)","v":0},{"$f":"IF($E1176<410.01,$E1176,$E1176*I1176/1/12*$H1176)","v":0}]
[null,null,null,{"$f":"Journal!A1158","v":0},{"$f":"Journal!B1158","v":0},{"$f":"Journal!C1158","v":0},{"$f":"Journal!D1158","v":0},13,0,0,0,0]
[null,null,null,{"$f":"Journal!A1159","v":0},{"$f":"Journal!B1159","v":0},{"$f":"Journal!C1159","v":0},{"$f":"Journal!D1159","v":0},13,0,0,0,0]
[null,null,null,{"$f":"Journal!A1160","v":0},{"$f":"Journal!B1160","v":0},{"$f":"Journal!C1160","v":0},{"$f":"Journal!D1160","v":0},13,0,0,0,0]
[null,null,null,{"$f":"Journal!A1161","v":0},{"$f":"Journal!B1161","v":0},{"$f":"Journal!C1161","v":0},{"$f":"Journal!D1161","v":0},13,0,0,0,0]
[null,null,null,{"$f":"Journal!A1162","v":0},{"$f":"Journal!B1162","v":0},{"$f":"Journal!C1162","v":0},{"$f":"Journal!D1162","v":0},13,0,0,0,0]
[null,null,null,{"$f":"Journal!A1163","v":0},{"$f":"Journal!B1163","v":0},{"$f":"Journal!C1163","v":0},{"$f":"Journal!D1163","v":0},13,0,0,0,0]
[null,null,null,{"$f":"Journal!A1164","v":0},{"$f":"Journal!B1164","v":0},{"$f":"Journal!C1164","v":0},{"$f":"Journal!D1164","v":0},13,0,0,0,0]
[null,null,null,{"$f":"Journal!A1165","v":0},{"$f":"Journal!B1165","v":0},{"$f":"Journal!C1165","v":0},{"$f":"Journal!D1165","v":0},13,0,0,0,0]
[null,null,null,{"$f":"Journal!A1166","v":0},{"$f":"Journal!B1166","v":0},{"$f":"Journal!C1166","v":0},{"$f":"Journal!D1166","v":0},13,0,0,0,0]
[null,null,null,{"$f":"Journal!A1167","v":0},{"$f":"Journal!B1167","v":0},{"$f":"Journal!C1167","v":0},{"$f":"Journal!D1167","v":0},13,0,0,0,0]
[null,null,null,{"$f":"Journal!A1168","v":0},{"$f":"Journal!B1168","v":0},{"$f":"Journal!C1168","v":0},{"$f":"Journal!D1168","v":0},13,0,0,0,0]
[null,null,null,{"$f":"Journal!A1169","v":0},{"$f":"Journal!B1169","v":0},{"$f":"Journal!C1169","v":0},{"$f":"Journal!D1169","v":0},13,0,0,0,0]
[null,null,null,{"$f":"Journal!A1170","v":0},{"$f":"Journal!B1170","v":0},{"$f":"Journal!C1170","v":0},{"$f":"Journal!D1170","v":0},13,0,0,0,0]
[null,null,null,{"$f":"Journal!A1171","v":0},{"$f":"Journal!B1171","v":0},{"$f":"Journal!C1171","v":0},{"$f":"Journal!D1171","v":0},13,0,0,0,0]
[null,null,null,{"$f":"Journal!A1172","v":0},{"$f":"Journal!B1172","v":0},{"$f":"Journal!C1172","v":0},{"$f":"Journal!D1172","v":0},13,0,0,0,0]
[null,null,null,{"$f":"Journal!A1173","v":0},{"$f":"Journal!B1173","v":0},{"$f":"Journal!C1173","v":0},{"$f":"Journal!D1173","v":0},13,0,0,0,0]
[null,null,null,{"$f":"Journal!A1174","v":0},{"$f":"Journal!B1174","v":0},{"$f":"Journal!C1174","v":0},{"$f":"Journal!D1174","v":0},13,0,0,0,0]
[null,null,null,{"$f":"Journal!A1175","v":0},{"$f":"Journal!B1175","v":0},{"$f":"Journal!C1175","v":0},{"$f":"Journal!D1175","v":0},13,0,0,0,0]
[null,null,null,{"$f":"Journal!A1176","v":0},{"$f":"Journal!B1176","v":0},{"$f":"Journal!C1176","v":0},{"$f":"Journal!D1176","v":0},13,0,0,0,0]
[null,null,null,{"$f":"Journal!A1177","v":0},{"$f":"Journal!B1177","v":0},{"$f":"Journal!C1177","v":0},{"$f":"Journal!D1177","v":0},13,0,0,0,0]
[null,null,null,{"$f":"Journal!A1178","v":0},{"$f":"Journal!B1178","v":0},{"$f":"Journal!C1178","v":0},{"$f":"Journal!D1178","v":0},13,0,0,0,0]
[null,null,null,{"$f":"Journal!A1179","v":0},{"$f":"Journal!B1179","v":0},{"$f":"Journal!C1179","v":0},{"$f":"Journal!D1179","v":0},13,0,0,0,0]
[null,null,null,{"$f":"Journal!A1180","v":0},{"$f":"Journal!B1180","v":0},{"$f":"Journal!C1180","v":0},{"$f":"Journal!D1180","v":0},13,0,0,0,0]
[null,null,null,{"$f":"Journal!A1181","v":0},{"$f":"Journal!B1181","v":0},{"$f":"Journal!C1181","v":0},{"$f":"Journal!D1181","v":0},13,0,0,0,0]
[null,null,null,{"$f":"Journal!A1182","v":0},{"$f":"Journal!B1182","v":0},{"$f":"Journal!C1182","v":0},{"$f":"Journal!D1182","v":0},13,0,0,0,0]
[null,null,null,{"$f":"Journal!A1183","v":0},{"$f":"Journal!B1183","v":0},{"$f":"Journal!C1183","v":0},{"$f":"Journal!D1183","v":0},13,0,0,0,0]
[null,null,null,{"$f":"Journal!A1184","v":0},{"$f":"Journal!B1184","v":0},{"$f":"Journal!C1184","v":0},{"$f":"Journal!D1184","v":0},13,0,0,0,0]
[null,null,null,{"$f":"Journal!A1185","v":0},{"$f":"Journal!B1185","v":0},{"$f":"Journal!C1185","v":0},{"$f":"Journal!D1185","v":0},13,0,0,0,0]
[null,null,null,{"$f":"Journal!A1186","v":0},{"$f":"Journal!B1186","v":0},{"$f":"Journal!C1186","v":0},{"$f":"Journal!D1186","v":0},13,0,0,0,0]
[null,null,null,{"$f":"Journal!A1187","v":0},{"$f":"Journal!B1187","v":0},{"$f":"Journal!C1187","v":0},{"$f":"Journal!D1187","v":0},13,0,0,0,0]
[null,null,null,{"$f":"Journal!A1188","v":0},{"$f":"Journal!B1188","v":0},{"$f":"Journal!C1188","v":0},{"$f":"Journal!D1188","v":0},13,0,0,0,0]
[null,null,null,{"$f":"Journal!A1189","v":0},{"$f":"Journal!B1189","v":0},{"$f":"Journal!C1189","v":0},{"$f":"Journal!D1189","v":0},13,0,0,0,0]
[null,null,null,{"$f":"Journal!A1190","v":0},{"$f":"Journal!B1190","v":0},{"$f":"Journal!C1190","v":0},{"$f":"Journal!D1190","v":0},13,0,0,0,0]
[null,null,null,{"$f":"Journal!A1191","v":0},{"$f":"Journal!B1191","v":0},{"$f":"Journal!C1191","v":0},{"$f":"Journal!D1191","v":0},13,0,0,0,0]
[null,null,null,{"$f":"Journal!A1192","v":0},{"$f":"Journal!B1192","v":0},{"$f":"Journal!C1192","v":0},{"$f":"Journal!D1192","v":0},13,0,0,0,0]
[null,null,null,{"$f":"Journal!A1193","v":0},{"$f":"Journal!B1193","v":0},{"$f":"Journal!C1193","v":0},{"$f":"Journal!D1193","v":0},13,0,0,0,0]
[null,null,null,{"$f":"Journal!A1194","v":0},{"$f":"Journal!B1194","v":0},{"$f":"Journal!C1194","v":0},{"$f":"Journal!D1194","v":0},13,0,0,0,0]
[null,null,null,{"$f":"Journal!A1195","v":0},{"$f":"Journal!B1195","v":0},{"$f":"Journal!C1195","v":0},{"$f":"Journal!D1195","v":0},13,0,0,0,0]
[null,null,null,{"$f":"Journal!A1196","v":0},{"$f":"Journal!B1196","v":0},{"$f":"Journal!C1196","v":0},{"$f":"Journal!D1196","v":0},13,0,0,0,0]
[null,null,null,{"$f":"Journal!A1197","v":0},{"$f":"Journal!B1197","v":0},{"$f":"Journal!C1197","v":0},{"$f":"Journal!D1197","v":0},13,0,0,0,0]
[null,null,null,{"$f":"Journal!A1198","v":0},{"$f":"Journal!B1198","v":0},{"$f":"Journal!C1198","v":0},{"$f":"Journal!D1198","v":0},13,0,0,0,0]
[null,null,null,{"$f":"Journal!A1199","v":0},{"$f":"Journal!B1199","v":0},{"$f":"Journal!C1199","v":0},{"$f":"Journal!D1199","v":0},13,0,0,0,0]
[null,null,null,{"$f":"Journal!A1200","v":0},{"$f":"Journal!B1200","v":0},{"$f":"Journal!C1200","v":0},{"$f":"Journal!D1200","v":0},13,0,0,0,0]
[null,null,null,{"$f":"Journal!A1201","v":0},{"$f":"Journal!B1201","v":0},{"$f":"Journal!C1201","v":0},{"$f":"Journal!D1201","v":0},13,0,0,0,0]
[null,null,null,{"$f":"Journal!A1202","v":0},{"$f":"Journal!B1202","v":0},{"$f":"Journal!C1202","v":0},{"$f":"Journal!D1202","v":0},13,0,0,0,0]
[null,null,null,{"$f":"Journal!A1203","v":0},{"$f":"Journal!B1203","v":0},{"$f":"Journal!C1203","v":0},{"$f":"Journal!D1203","v":0},13,0,0,0,0]
[null,null,null,{"$f":"Journal!A1204","v":0},{"$f":"Journal!B1204","v":0},{"$f":"Journal!C1204","v":0},{"$f":"Journal!D1204","v":0},13,0,0,0,0]
[null,null,null,{"$f":"Journal!A1205","v":0},{"$f":"Journal!B1205","v":0},{"$f":"Journal!C1205","v":0},{"$f":"Journal!D1205","v":0},13,0,0,0,0]
[null,null,null,{"$f":"Journal!A1206","v":0},{"$f":"Journal!B1206","v":0},{"$f":"Journal!C1206","v":0},{"$f":"Journal!D1206","v":0},13,0,0,0,0]
[null,null,null,{"$f":"Journal!A1207","v":0},{"$f":"Journal!B1207","v":0},{"$f":"Journal!C1207","v":0},{"$f":"Journal!D1207","v":0},13,0,0,0,0]
[null,null,null,{"$f":"Journal!A1208","v":0},{"$f":"Journal!B1208","v":0},{"$f":"Journal!C1208","v":0},{"$f":"Journal!D1208","v":0},13,0,0,0,0]
[null,null,null,{"$f":"Journal!A1209","v":0},{"$f":"Journal!B1209","v":0},{"$f":"Journal!C1209","v":0},{"$f":"Journal!D1209","v":0},13,0,0,0,0]
[null,null,null,{"$f":"Journal!A1210","v":0},{"$f":"Journal!B1210","v":0},{"$f":"Journal!C1210","v":0},{"$f":"Journal!D1210","v":0},13,0,0,0,0]
[null,null,null,{"$f":"Journal!A1211","v":0},{"$f":"Journal!B1211","v":0},{"$f":"Journal!C1211","v":0},{"$f":"Journal!D1211","v":0},13,0,0,0,0]
[null,null,null,{"$f":"Journal!A1212","v":0},{"$f":"Journal!B1212","v":0},{"$f":"Journal!C1212","v":0},{"$f":"Journal!D1212","v":0},13,0,0,0,0]
[null,null,null,{"$f":"Journal!A1213","v":0},{"$f":"Journal!B1213","v":0},{"$f":"Journal!C1213","v":0},{"$f":"Journal!D1213","v":0},13,0,0,0,0]
[null,null,null,{"$f":"Journal!A1214","v":0},{"$f":"Journal!B1214","v":0},{"$f":"Journal!C1214","v":0},{"$f":"Journal!D1214","v":0},13,0,0,0,0]
[null,null,null,{"$f":"Journal!A1215","v":0},{"$f":"Journal!B1215","v":0},{"$f":"Journal!C1215","v":0},{"$f":"Journal!D1215","v":0},13,0,0,0,0]
[null,null,null,{"$f":"Journal!A1216","v":0},{"$f":"Journal!B1216","v":0},{"$f":"Journal!C1216","v":0},{"$f":"Journal!D1216","v":0},13,0,0,0,0]
[null,null,null,{"$f":"Journal!A1217","v":0},{"$f":"Journal!B1217","v":0},{"$f":"Journal!C1217","v":0},{"$f":"Journal!D1217","v":0},13,0,0,0,0]
[null,null,null,{"$f":"Journal!A1218","v":0},{"$f":"Journal!B1218","v":0},{"$f":"Journal!C1218","v":0},{"$f":"Journal!D1218","v":0},13,0,0,0,0]
[null,null,null,{"$f":"Journal!A1219","v":0},{"$f":"Journal!B1219","v":0},{"$f":"Journal!C1219","v":0},{"$f":"Journal!D1219","v":0},13,0,0,0,0]
[null,null,null,{"$f":"Journal!A1220","v":0},{"$f":"Journal!B1220","v":0},{"$f":"Journal!C1220","v":0},{"$f":"Journal!D1220","v":0},13,0,0,0,0]
[null,null,null,{"$f":"Journal!A1221","v":0},{"$f":"Journal!B1221","v":0},{"$f":"Journal!C1221","v":0},{"$f":"Journal!D1221","v":0},{"$f":"12-G1240+1","v":13},{"$f":"IF(AND(E1240=0,F1240=0),0,IF(1/F1240*2.5>25%,25%,1/F1240*2.5))","v":0},{"$f":"E1240/5","v":0},{"$f":"IF($E1240<410.01,$E1240,$E1240/$F1240/12*$H1240)","v":0},{"$f":"IF($E1240<410.01,$E1240,$E1240*I1240/1/12*$H1240)","v":0}]
[null,null,null,{"$f":"Journal!A1222","v":0},{"$f":"Journal!B1222","v":0},{"$f":"Journal!C1222","v":0},{"$f":"Journal!D1222","v":0},13,0,0,0,0]
[null,null,null,{"$f":"Journal!A1223","v":0},{"$f":"Journal!B1223","v":0},{"$f":"Journal!C1223","v":0},{"$f":"Journal!D1223","v":0},13,0,0,0,0]
[null,null,null,{"$f":"Journal!A1224","v":0},{"$f":"Journal!B1224","v":0},{"$f":"Journal!C1224","v":0},{"$f":"Journal!D1224","v":0},13,0,0,0,0]
[null,null,null,{"$f":"Journal!A1225","v":0},{"$f":"Journal!B1225","v":0},{"$f":"Journal!C1225","v":0},{"$f":"Journal!D1225","v":0},13,0,0,0,0]
[null,null,null,{"$f":"Journal!A1226","v":0},{"$f":"Journal!B1226","v":0},{"$f":"Journal!C1226","v":0},{"$f":"Journal!D1226","v":0},13,0,0,0,0]
[null,null,null,{"$f":"Journal!A1227","v":0},{"$f":"Journal!B1227","v":0},{"$f":"Journal!C1227","v":0},{"$f":"Journal!D1227","v":0},13,0,0,0,0]
[null,null,null,{"$f":"Journal!A1228","v":0},{"$f":"Journal!B1228","v":0},{"$f":"Journal!C1228","v":0},{"$f":"Journal!D1228","v":0},13,0,0,0,0]
[null,null,null,{"$f":"Journal!A1229","v":0},{"$f":"Journal!B1229","v":0},{"$f":"Journal!C1229","v":0},{"$f":"Journal!D1229","v":0},13,0,0,0,0]
[null,null,null,{"$f":"Journal!A1230","v":0},{"$f":"Journal!B1230","v":0},{"$f":"Journal!C1230","v":0},{"$f":"Journal!D1230","v":0},13,0,0,0,0]
[null,null,null,{"$f":"Journal!A1231","v":0},{"$f":"Journal!B1231","v":0},{"$f":"Journal!C1231","v":0},{"$f":"Journal!D1231","v":0},13,0,0,0,0]
[null,null,null,{"$f":"Journal!A1232","v":0},{"$f":"Journal!B1232","v":0},{"$f":"Journal!C1232","v":0},{"$f":"Journal!D1232","v":0},13,0,0,0,0]
[null,null,null,{"$f":"Journal!A1233","v":0},{"$f":"Journal!B1233","v":0},{"$f":"Journal!C1233","v":0},{"$f":"Journal!D1233","v":0},13,0,0,0,0]
[null,null,null,{"$f":"Journal!A1234","v":0},{"$f":"Journal!B1234","v":0},{"$f":"Journal!C1234","v":0},{"$f":"Journal!D1234","v":0},13,0,0,0,0]
[null,null,null,{"$f":"Journal!A1235","v":0},{"$f":"Journal!B1235","v":0},{"$f":"Journal!C1235","v":0},{"$f":"Journal!D1235","v":0},13,0,0,0,0]
[null,null,null,{"$f":"Journal!A1236","v":0},{"$f":"Journal!B1236","v":0},{"$f":"Journal!C1236","v":0},{"$f":"Journal!D1236","v":0},13,0,0,0,0]
[null,null,null,{"$f":"Journal!A1237","v":0},{"$f":"Journal!B1237","v":0},{"$f":"Journal!C1237","v":0},{"$f":"Journal!D1237","v":0},13,0,0,0,0]
[null,null,null,{"$f":"Journal!A1238","v":0},{"$f":"Journal!B1238","v":0},{"$f":"Journal!C1238","v":0},{"$f":"Journal!D1238","v":0},13,0,0,0,0]
[null,null,null,{"$f":"Journal!A1239","v":0},{"$f":"Journal!B1239","v":0},{"$f":"Journal!C1239","v":0},{"$f":"Journal!D1239","v":0},13,0,0,0,0]
[null,null,null,{"$f":"Journal!A1240","v":0},{"$f":"Journal!B1240","v":0},{"$f":"Journal!C1240","v":0},{"$f":"Journal!D1240","v":0},13,0,0,0,0]
[null,null,null,{"$f":"Journal!A1241","v":0},{"$f":"Journal!B1241","v":0},{"$f":"Journal!C1241","v":0},{"$f":"Journal!D1241","v":0},13,0,0,0,0]
[null,null,null,{"$f":"Journal!A1242","v":0},{"$f":"Journal!B1242","v":0},{"$f":"Journal!C1242","v":0},{"$f":"Journal!D1242","v":0},13,0,0,0,0]
[null,null,null,{"$f":"Journal!A1243","v":0},{"$f":"Journal!B1243","v":0},{"$f":"Journal!C1243","v":0},{"$f":"Journal!D1243","v":0},13,0,0,0,0]
[null,null,null,{"$f":"Journal!A1244","v":0},{"$f":"Journal!B1244","v":0},{"$f":"Journal!C1244","v":0},{"$f":"Journal!D1244","v":0},13,0,0,0,0]
[null,null,null,{"$f":"Journal!A1245","v":0},{"$f":"Journal!B1245","v":0},{"$f":"Journal!C1245","v":0},{"$f":"Journal!D1245","v":0},13,0,0,0,0]
[null,null,null,{"$f":"Journal!A1246","v":0},{"$f":"Journal!B1246","v":0},{"$f":"Journal!C1246","v":0},{"$f":"Journal!D1246","v":0},13,0,0,0,0]
[null,null,null,{"$f":"Journal!A1247","v":0},{"$f":"Journal!B1247","v":0},{"$f":"Journal!C1247","v":0},{"$f":"Journal!D1247","v":0},13,0,0,0,0]
[null,null,null,{"$f":"Journal!A1248","v":0},{"$f":"Journal!B1248","v":0},{"$f":"Journal!C1248","v":0},{"$f":"Journal!D1248","v":0},13,0,0,0,0]
[null,null,null,{"$f":"Journal!A1249","v":0},{"$f":"Journal!B1249","v":0},{"$f":"Journal!C1249","v":0},{"$f":"Journal!D1249","v":0},13,0,0,0,0]
[null,null,null,{"$f":"Journal!A1250","v":0},{"$f":"Journal!B1250","v":0},{"$f":"Journal!C1250","v":0},{"$f":"Journal!D1250","v":0},13,0,0,0,0]
[null,null,null,{"$f":"Journal!A1251","v":0},{"$f":"Journal!B1251","v":0},{"$f":"Journal!C1251","v":0},{"$f":"Journal!D1251","v":0},13,0,0,0,0]
[null,null,null,{"$f":"Journal!A1252","v":0},{"$f":"Journal!B1252","v":0},{"$f":"Journal!C1252","v":0},{"$f":"Journal!D1252","v":0},13,0,0,0,0]
[null,null,null,{"$f":"Journal!A1253","v":0},{"$f":"Journal!B1253","v":0},{"$f":"Journal!C1253","v":0},{"$f":"Journal!D1253","v":0},13,0,0,0,0]
[null,null,null,{"$f":"Journal!A1254","v":0},{"$f":"Journal!B1254","v":0},{"$f":"Journal!C1254","v":0},{"$f":"Journal!D1254","v":0},13,0,0,0,0]
[null,null,null,{"$f":"Journal!A1255","v":0},{"$f":"Journal!B1255","v":0},{"$f":"Journal!C1255","v":0},{"$f":"Journal!D1255","v":0},13,0,0,0,0]
[null,null,null,{"$f":"Journal!A1256","v":0},{"$f":"Journal!B1256","v":0},{"$f":"Journal!C1256","v":0},{"$f":"Journal!D1256","v":0},13,0,0,0,0]
[null,null,null,{"$f":"Journal!A1257","v":0},{"$f":"Journal!B1257","v":0},{"$f":"Journal!C1257","v":0},{"$f":"Journal!D1257","v":0},13,0,0,0,0]
[null,null,null,{"$f":"Journal!A1258","v":0},{"$f":"Journal!B1258","v":0},{"$f":"Journal!C1258","v":0},{"$f":"Journal!D1258","v":0},13,0,0,0,0]
[null,null,null,{"$f":"Journal!A1259","v":0},{"$f":"Journal!B1259","v":0},{"$f":"Journal!C1259","v":0},{"$f":"Journal!D1259","v":0},13,0,0,0,0]
[null,null,null,{"$f":"Journal!A1260","v":0},{"$f":"Journal!B1260","v":0},{"$f":"Journal!C1260","v":0},{"$f":"Journal!D1260","v":0},13,0,0,0,0]
[null,null,null,{"$f":"Journal!A1261","v":0},{"$f":"Journal!B1261","v":0},{"$f":"Journal!C1261","v":0},{"$f":"Journal!D1261","v":0},13,0,0,0,0]
[null,null,null,{"$f":"Journal!A1262","v":0},{"$f":"Journal!B1262","v":0},{"$f":"Journal!C1262","v":0},{"$f":"Journal!D1262","v":0},13,0,0,0,0]
[null,null,null,{"$f":"Journal!A1263","v":0},{"$f":"Journal!B1263","v":0},{"$f":"Journal!C1263","v":0},{"$f":"Journal!D1263","v":0},13,0,0,0,0]
[null,null,null,{"$f":"Journal!A1264","v":0},{"$f":"Journal!B1264","v":0},{"$f":"Journal!C1264","v":0},{"$f":"Journal!D1264","v":0},13,0,0,0,0]
[null,null,null,{"$f":"Journal!A1265","v":0},{"$f":"Journal!B1265","v":0},{"$f":"Journal!C1265","v":0},{"$f":"Journal!D1265","v":0},13,0,0,0,0]
[null,null,null,{"$f":"Journal!A1266","v":0},{"$f":"Journal!B1266","v":0},{"$f":"Journal!C1266","v":0},{"$f":"Journal!D1266","v":0},13,0,0,0,0]
[null,null,null,{"$f":"Journal!A1267","v":0},{"$f":"Journal!B1267","v":0},{"$f":"Journal!C1267","v":0},{"$f":"Journal!D1267","v":0},13,0,0,0,0]
[null,null,null,{"$f":"Journal!A1268","v":0},{"$f":"Journal!B1268","v":0},{"$f":"Journal!C1268","v":0},{"$f":"Journal!D1268","v":0},13,0,0,0,0]
[null,null,null,{"$f":"Journal!A1269","v":0},{"$f":"Journal!B1269","v":0},{"$f":"Journal!C1269","v":0},{"$f":"Journal!D1269","v":0},13,0,0,0,0]
[null,null,null,{"$f":"Journal!A1270","v":0},{"$f":"Journal!B1270","v":0},{"$f":"Journal!C1270","v":0},{"$f":"Journal!D1270","v":0},13,0,0,0,0]
[null,null,null,{"$f":"Journal!A1271","v":0},{"$f":"Journal!B1271","v":0},{"$f":"Journal!C1271","v":0},{"$f":"Journal!D1271","v":0},13,0,0,0,0]
[null,null,null,{"$f":"Journal!A1272","v":0},{"$f":"Journal!B1272","v":0},{"$f":"Journal!C1272","v":0},{"$f":"Journal!D1272","v":0},13,0,0,0,0]
[null,null,null,{"$f":"Journal!A1273","v":0},{"$f":"Journal!B1273","v":0},{"$f":"Journal!C1273","v":0},{"$f":"Journal!D1273","v":0},13,0,0,0,0]
[null,null,null,{"$f":"Journal!A1274","v":0},{"$f":"Journal!B1274","v":0},{"$f":"Journal!C1274","v":0},{"$f":"Journal!D1274","v":0},13,0,0,0,0]
[null,null,null,{"$f":"Journal!A1275","v":0},{"$f":"Journal!B1275","v":0},{"$f":"Journal!C1275","v":0},{"$f":"Journal!D1275","v":0},13,0,0,0,0]
[null,null,null,{"$f":"Journal!A1276","v":0},{"$f":"Journal!B1276","v":0},{"$f":"Journal!C1276","v":0},{"$f":"Journal!D1276","v":0},13,0,0,0,0]
[null,null,null,{"$f":"Journal!A1277","v":0},{"$f":"Journal!B1277","v":0},{"$f":"Journal!C1277","v":0},{"$f":"Journal!D1277","v":0},13,0,0,0,0]
[null,null,null,{"$f":"Journal!A1278","v":0},{"$f":"Journal!B1278","v":0},{"$f":"Journal!C1278","v":0},{"$f":"Journal!D1278","v":0},13,0,0,0,0]
[null,null,null,{"$f":"Journal!A1279","v":0},{"$f":"Journal!B1279","v":0},{"$f":"Journal!C1279","v":0},{"$f":"Journal!D1279","v":0},13,0,0,0,0]
[null,null,null,{"$f":"Journal!A1280","v":0},{"$f":"Journal!B1280","v":0},{"$f":"Journal!C1280","v":0},{"$f":"Journal!D1280","v":0},13,0,0,0,0]
[null,null,null,{"$f":"Journal!A1281","v":0},{"$f":"Journal!B1281","v":0},{"$f":"Journal!C1281","v":0},{"$f":"Journal!D1281","v":0},13,0,0,0,0]
[null,null,null,{"$f":"Journal!A1282","v":0},{"$f":"Journal!B1282","v":0},{"$f":"Journal!C1282","v":0},{"$f":"Journal!D1282","v":0},13,0,0,0,0]
[null,null,null,{"$f":"Journal!A1283","v":0},{"$f":"Journal!B1283","v":0},{"$f":"Journal!C1283","v":0},{"$f":"Journal!D1283","v":0},13,0,0,0,0]
[null,null,null,{"$f":"Journal!A1284","v":0},{"$f":"Journal!B1284","v":0},{"$f":"Journal!C1284","v":0},{"$f":"Journal!D1284","v":0},13,0,0,0,0]
[null,null,null,{"$f":"Journal!A1285","v":0},{"$f":"Journal!B1285","v":0},{"$f":"Journal!C1285","v":0},{"$f":"Journal!D1285","v":0},{"$f":"12-G1304+1","v":13},{"$f":"IF(AND(E1304=0,F1304=0),0,IF(1/F1304*2.5>25%,25%,1/F1304*2.5))","v":0},{"$f":"E1304/5","v":0},{"$f":"IF($E1304<410.01,$E1304,$E1304/$F1304/12*$H1304)","v":0},{"$f":"IF($E1304<410.01,$E1304,$E1304*I1304/1/12*$H1304)","v":0}]
[null,null,null,{"$f":"Journal!A1286","v":0},{"$f":"Journal!B1286","v":0},{"$f":"Journal!C1286","v":0},{"$f":"Journal!D1286","v":0},13,0,0,0,0]
[null,null,null,{"$f":"Journal!A1287","v":0},{"$f":"Journal!B1287","v":0},{"$f":"Journal!C1287","v":0},{"$f":"Journal!D1287","v":0},13,0,0,0,0]
[null,null,null,{"$f":"Journal!A1288","v":0},{"$f":"Journal!B1288","v":0},{"$f":"Journal!C1288","v":0},{"$f":"Journal!D1288","v":0},13,0,0,0,0]
[null,null,null,{"$f":"Journal!A1289","v":0},{"$f":"Journal!B1289","v":0},{"$f":"Journal!C1289","v":0},{"$f":"Journal!D1289","v":0},13,0,0,0,0]
[null,null,null,{"$f":"Journal!A1290","v":0},{"$f":"Journal!B1290","v":0},{"$f":"Journal!C1290","v":0},{"$f":"Journal!D1290","v":0},13,0,0,0,0]
[null,null,null,{"$f":"Journal!A1291","v":0},{"$f":"Journal!B1291","v":0},{"$f":"Journal!C1291","v":0},{"$f":"Journal!D1291","v":0},13,0,0,0,0]
[null,null,null,{"$f":"Journal!A1292","v":0},{"$f":"Journal!B1292","v":0},{"$f":"Journal!C1292","v":0},{"$f":"Journal!D1292","v":0},13,0,0,0,0]
[null,null,null,{"$f":"Journal!A1293","v":0},{"$f":"Journal!B1293","v":0},{"$f":"Journal!C1293","v":0},{"$f":"Journal!D1293","v":0},13,0,0,0,0]
[null,null,null,{"$f":"Journal!A1294","v":0},{"$f":"Journal!B1294","v":0},{"$f":"Journal!C1294","v":0},{"$f":"Journal!D1294","v":0},13,0,0,0,0]
[null,null,null,{"$f":"Journal!A1295","v":0},{"$f":"Journal!B1295","v":0},{"$f":"Journal!C1295","v":0},{"$f":"Journal!D1295","v":0},13,0,0,0,0]
[null,null,null,{"$f":"Journal!A1296","v":0},{"$f":"Journal!B1296","v":0},{"$f":"Journal!C1296","v":0},{"$f":"Journal!D1296","v":0},13,0,0,0,0]
[null,null,null,{"$f":"Journal!A1297","v":0},{"$f":"Journal!B1297","v":0},{"$f":"Journal!C1297","v":0},{"$f":"Journal!D1297","v":0},13,0,0,0,0]
[null,null,null,{"$f":"Journal!A1298","v":0},{"$f":"Journal!B1298","v":0},{"$f":"Journal!C1298","v":0},{"$f":"Journal!D1298","v":0},13,0,0,0,0]
[null,null,null,{"$f":"Journal!A1299","v":0},{"$f":"Journal!B1299","v":0},{"$f":"Journal!C1299","v":0},{"$f":"Journal!D1299","v":0},13,0,0,0,0]
[null,null,null,{"$f":"Journal!A1300","v":0},{"$f":"Journal!B1300","v":0},{"$f":"Journal!C1300","v":0},{"$f":"Journal!D1300","v":0},13,0,0,0,0]
[null,null,null,{"$f":"Journal!A1301","v":0},{"$f":"Journal!B1301","v":0},{"$f":"Journal!C1301","v":0},{"$f":"Journal!D1301","v":0},13,0,0,0,0]
[null,null,null,{"$f":"Journal!A1302","v":0},{"$f":"Journal!B1302","v":0},{"$f":"Journal!C1302","v":0},{"$f":"Journal!D1302","v":0},13,0,0,0,0]
[null,null,null,{"$f":"Journal!A1303","v":0},{"$f":"Journal!B1303","v":0},{"$f":"Journal!C1303","v":0},{"$f":"Journal!D1303","v":0},13,0,0,0,0]
[null,null,null,{"$f":"Journal!A1304","v":0},{"$f":"Journal!B1304","v":0},{"$f":"Journal!C1304","v":0},{"$f":"Journal!D1304","v":0},13,0,0,0,0]
[null,null,null,{"$f":"Journal!A1305","v":0},{"$f":"Journal!B1305","v":0},{"$f":"Journal!C1305","v":0},{"$f":"Journal!D1305","v":0},13,0,0,0,0]
[null,null,null,{"$f":"Journal!A1306","v":0},{"$f":"Journal!B1306","v":0},{"$f":"Journal!C1306","v":0},{"$f":"Journal!D1306","v":0},13,0,0,0,0]
[null,null,null,{"$f":"Journal!A1307","v":0},{"$f":"Journal!B1307","v":0},{"$f":"Journal!C1307","v":0},{"$f":"Journal!D1307","v":0},13,0,0,0,0]
[null,null,null,{"$f":"Journal!A1308","v":0},{"$f":"Journal!B1308","v":0},{"$f":"Journal!C1308","v":0},{"$f":"Journal!D1308","v":0},13,0,0,0,0]
[null,null,null,{"$f":"Journal!A1309","v":0},{"$f":"Journal!B1309","v":0},{"$f":"Journal!C1309","v":0},{"$f":"Journal!D1309","v":0},13,0,0,0,0]
[null,null,null,{"$f":"Journal!A1310","v":0},{"$f":"Journal!B1310","v":0},{"$f":"Journal!C1310","v":0},{"$f":"Journal!D1310","v":0},13,0,0,0,0]
[null,null,null,{"$f":"Journal!A1311","v":0},{"$f":"Journal!B1311","v":0},{"$f":"Journal!C1311","v":0},{"$f":"Journal!D1311","v":0},13,0,0,0,0]
[null,null,null,{"$f":"Journal!A1312","v":0},{"$f":"Journal!B1312","v":0},{"$f":"Journal!C1312","v":0},{"$f":"Journal!D1312","v":0},13,0,0,0,0]
[null,null,null,{"$f":"Journal!A1313","v":0},{"$f":"Journal!B1313","v":0},{"$f":"Journal!C1313","v":0},{"$f":"Journal!D1313","v":0},13,0,0,0,0]
[null,null,null,{"$f":"Journal!A1314","v":0},{"$f":"Journal!B1314","v":0},{"$f":"Journal!C1314","v":0},{"$f":"Journal!D1314","v":0},13,0,0,0,0]
[null,null,null,{"$f":"Journal!A1315","v":0},{"$f":"Journal!B1315","v":0},{"$f":"Journal!C1315","v":0},{"$f":"Journal!D1315","v":0},13,0,0,0,0]
[null,null,null,{"$f":"Journal!A1316","v":0},{"$f":"Journal!B1316","v":0},{"$f":"Journal!C1316","v":0},{"$f":"Journal!D1316","v":0},13,0,0,0,0]
[null,null,null,{"$f":"Journal!A1317","v":0},{"$f":"Journal!B1317","v":0},{"$f":"Journal!C1317","v":0},{"$f":"Journal!D1317","v":0},13,0,0,0,0]
[null,null,null,{"$f":"Journal!A1318","v":0},{"$f":"Journal!B1318","v":0},{"$f":"Journal!C1318","v":0},{"$f":"Journal!D1318","v":0},13,0,0,0,0]
[null,null,null,{"$f":"Journal!A1319","v":0},{"$f":"Journal!B1319","v":0},{"$f":"Journal!C1319","v":0},{"$f":"Journal!D1319","v":0},13,0,0,0,0]
[null,null,null,{"$f":"Journal!A1320","v":0},{"$f":"Journal!B1320","v":0},{"$f":"Journal!C1320","v":0},{"$f":"Journal!D1320","v":0},13,0,0,0,0]
[null,null,null,{"$f":"Journal!A1321","v":0},{"$f":"Journal!B1321","v":0},{"$f":"Journal!C1321","v":0},{"$f":"Journal!D1321","v":0},13,0,0,0,0]
[null,null,null,{"$f":"Journal!A1322","v":0},{"$f":"Journal!B1322","v":0},{"$f":"Journal!C1322","v":0},{"$f":"Journal!D1322","v":0},13,0,0,0,0]
[null,null,null,{"$f":"Journal!A1323","v":0},{"$f":"Journal!B1323","v":0},{"$f":"Journal!C1323","v":0},{"$f":"Journal!D1323","v":0},13,0,0,0,0]
[null,null,null,{"$f":"Journal!A1324","v":0},{"$f":"Journal!B1324","v":0},{"$f":"Journal!C1324","v":0},{"$f":"Journal!D1324","v":0},13,0,0,0,0]
[null,null,null,{"$f":"Journal!A1325","v":0},{"$f":"Journal!B1325","v":0},{"$f":"Journal!C1325","v":0},{"$f":"Journal!D1325","v":0},13,0,0,0,0]
[null,null,null,{"$f":"Journal!A1326","v":0},{"$f":"Journal!B1326","v":0},{"$f":"Journal!C1326","v":0},{"$f":"Journal!D1326","v":0},13,0,0,0,0]
[null,null,null,{"$f":"Journal!A1327","v":0},{"$f":"Journal!B1327","v":0},{"$f":"Journal!C1327","v":0},{"$f":"Journal!D1327","v":0},13,0,0,0,0]
[null,null,null,{"$f":"Journal!A1328","v":0},{"$f":"Journal!B1328","v":0},{"$f":"Journal!C1328","v":0},{"$f":"Journal!D1328","v":0},13,0,0,0,0]
[null,null,null,{"$f":"Journal!A1329","v":0},{"$f":"Journal!B1329","v":0},{"$f":"Journal!C1329","v":0},{"$f":"Journal!D1329","v":0},13,0,0,0,0]
[null,null,null,{"$f":"Journal!A1330","v":0},{"$f":"Journal!B1330","v":0},{"$f":"Journal!C1330","v":0},{"$f":"Journal!D1330","v":0},13,0,0,0,0]
[null,null,null,{"$f":"Journal!A1331","v":0},{"$f":"Journal!B1331","v":0},{"$f":"Journal!C1331","v":0},{"$f":"Journal!D1331","v":0},13,0,0,0,0]
[null,null,null,{"$f":"Journal!A1332","v":0},{"$f":"Journal!B1332","v":0},{"$f":"Journal!C1332","v":0},{"$f":"Journal!D1332","v":0},13,0,0,0,0]
[null,null,null,{"$f":"Journal!A1333","v":0},{"$f":"Journal!B1333","v":0},{"$f":"Journal!C1333","v":0},{"$f":"Journal!D1333","v":0},13,0,0,0,0]
[null,null,null,{"$f":"Journal!A1334","v":0},{"$f":"Journal!B1334","v":0},{"$f":"Journal!C1334","v":0},{"$f":"Journal!D1334","v":0},13,0,0,0,0]
[null,null,null,{"$f":"Journal!A1335","v":0},{"$f":"Journal!B1335","v":0},{"$f":"Journal!C1335","v":0},{"$f":"Journal!D1335","v":0},13,0,0,0,0]
[null,null,null,{"$f":"Journal!A1336","v":0},{"$f":"Journal!B1336","v":0},{"$f":"Journal!C1336","v":0},{"$f":"Journal!D1336","v":0},13,0,0,0,0]
[null,null,null,{"$f":"Journal!A1337","v":0},{"$f":"Journal!B1337","v":0},{"$f":"Journal!C1337","v":0},{"$f":"Journal!D1337","v":0},13,0,0,0,0]
[null,null,null,{"$f":"Journal!A1338","v":0},{"$f":"Journal!B1338","v":0},{"$f":"Journal!C1338","v":0},{"$f":"Journal!D1338","v":0},13,0,0,0,0]
[null,null,null,{"$f":"Journal!A1339","v":0},{"$f":"Journal!B1339","v":0},{"$f":"Journal!C1339","v":0},{"$f":"Journal!D1339","v":0},13,0,0,0,0]
[null,null,null,{"$f":"Journal!A1340","v":0},{"$f":"Journal!B1340","v":0},{"$f":"Journal!C1340","v":0},{"$f":"Journal!D1340","v":0},13,0,0,0,0]
[null,null,null,{"$f":"Journal!A1341","v":0},{"$f":"Journal!B1341","v":0},{"$f":"Journal!C1341","v":0},{"$f":"Journal!D1341","v":0},13,0,0,0,0]
[null,null,null,{"$f":"Journal!A1342","v":0},{"$f":"Journal!B1342","v":0},{"$f":"Journal!C1342","v":0},{"$f":"Journal!D1342","v":0},13,0,0,0,0]
[null,null,null,{"$f":"Journal!A1343","v":0},{"$f":"Journal!B1343","v":0},{"$f":"Journal!C1343","v":0},{"$f":"Journal!D1343","v":0},13,0,0,0,0]
[null,null,null,{"$f":"Journal!A1344","v":0},{"$f":"Journal!B1344","v":0},{"$f":"Journal!C1344","v":0},{"$f":"Journal!D1344","v":0},13,0,0,0,0]
[null,null,null,{"$f":"Journal!A1345","v":0},{"$f":"Journal!B1345","v":0},{"$f":"Journal!C1345","v":0},{"$f":"Journal!D1345","v":0},13,0,0,0,0]
[null,null,null,{"$f":"Journal!A1346","v":0},{"$f":"Journal!B1346","v":0},{"$f":"Journal!C1346","v":0},{"$f":"Journal!D1346","v":0},13,0,0,0,0]
[null,null,null,{"$f":"Journal!A1347","v":0},{"$f":"Journal!B1347","v":0},{"$f":"Journal!C1347","v":0},{"$f":"Journal!D1347","v":0},13,0,0,0,0]
[null,null,null,{"$f":"Journal!A1348","v":0},{"$f":"Journal!B1348","v":0},{"$f":"Journal!C1348","v":0},{"$f":"Journal!D1348","v":0},13,0,0,0,0]
[null,null,null,{"$f":"Journal!A1349","v":0},{"$f":"Journal!B1349","v":0},{"$f":"Journal!C1349","v":0},{"$f":"Journal!D1349","v":0},{"$f":"12-G1368+1","v":13},{"$f":"IF(AND(E1368=0,F1368=0),0,IF(1/F1368*2.5>25%,25%,1/F1368*2.5))","v":0},{"$f":"E1368/5","v":0},{"$f":"IF($E1368<410.01,$E1368,$E1368/$F1368/12*$H1368)","v":0},{"$f":"IF($E1368<410.01,$E1368,$E1368*I1368/1/12*$H1368)","v":0}]
[null,null,null,{"$f":"Journal!A1350","v":0},{"$f":"Journal!B1350","v":0},{"$f":"Journal!C1350","v":0},{"$f":"Journal!D1350","v":0},13,0,0,0,0]
[null,null,null,{"$f":"Journal!A1351","v":0},{"$f":"Journal!B1351","v":0},{"$f":"Journal!C1351","v":0},{"$f":"Journal!D1351","v":0},13,0,0,0,0]
[null,null,null,{"$f":"Journal!A1352","v":0},{"$f":"Journal!B1352","v":0},{"$f":"Journal!C1352","v":0},{"$f":"Journal!D1352","v":0},13,0,0,0,0]
[null,null,null,{"$f":"Journal!A1353","v":0},{"$f":"Journal!B1353","v":0},{"$f":"Journal!C1353","v":0},{"$f":"Journal!D1353","v":0},13,0,0,0,0]
[null,null,null,{"$f":"Journal!A1354","v":0},{"$f":"Journal!B1354","v":0},{"$f":"Journal!C1354","v":0},{"$f":"Journal!D1354","v":0},13,0,0,0,0]
[null,null,null,{"$f":"Journal!A1355","v":0},{"$f":"Journal!B1355","v":0},{"$f":"Journal!C1355","v":0},{"$f":"Journal!D1355","v":0},13,0,0,0,0]
[null,null,null,{"$f":"Journal!A1356","v":0},{"$f":"Journal!B1356","v":0},{"$f":"Journal!C1356","v":0},{"$f":"Journal!D1356","v":0},13,0,0,0,0]
[null,null,null,{"$f":"Journal!A1357","v":0},{"$f":"Journal!B1357","v":0},{"$f":"Journal!C1357","v":0},{"$f":"Journal!D1357","v":0},13,0,0,0,0]
[null,null,null,{"$f":"Journal!A1358","v":0},{"$f":"Journal!B1358","v":0},{"$f":"Journal!C1358","v":0},{"$f":"Journal!D1358","v":0},13,0,0,0,0]
[null,null,null,{"$f":"Journal!A1359","v":0},{"$f":"Journal!B1359","v":0},{"$f":"Journal!C1359","v":0},{"$f":"Journal!D1359","v":0},13,0,0,0,0]
[null,null,null,{"$f":"Journal!A1360","v":0},{"$f":"Journal!B1360","v":0},{"$f":"Journal!C1360","v":0},{"$f":"Journal!D1360","v":0},13,0,0,0,0]
[null,null,null,{"$f":"Journal!A1361","v":0},{"$f":"Journal!B1361","v":0},{"$f":"Journal!C1361","v":0},{"$f":"Journal!D1361","v":0},13,0,0,0,0]
[null,null,null,{"$f":"Journal!A1362","v":0},{"$f":"Journal!B1362","v":0},{"$f":"Journal!C1362","v":0},{"$f":"Journal!D1362","v":0},13,0,0,0,0]

{"sheet":"Journal","index":4,"n_rows":4,"n_cols":5,"rows_kept":4,"cut":false,"hidden":false,"merged":[]}
["Journal",null,null,null,"Start"]
["x"]
["x"]
["Bezeichnung","Wert","Abschreibungs-\nzeitraum","Anschaffungs-\nmonat"]

{"sheet":"VERLAUF","index":5,"n_rows":6,"n_cols":1,"rows_kept":6,"cut":false,"hidden":true,"merged":[]}
["Startseite"]
["Hilfe"]
["Eingaben"]
["Abschreibung"]
["Journal"]
["Tabvorlage"]

{"sheet":"Tabvorlage","index":6,"n_rows":6,"n_cols":10,"rows_kept":6,"cut":false,"hidden":true,"merged":[[0,2,2,10]]}
[null,null,{"$f":"Startseite!B1","v":"Abschreibungsalternativen"}]
[]
[]
[]
[]
[null,null,null,"Untertitel",null,null,null,null,null,"» Startseite"]

{"sheet":"Tabelle1","index":7,"n_rows":6,"n_cols":5,"rows_kept":6,"cut":false,"hidden":true,"merged":[]}
[false,"Kopfzeile",false,false,false]
[false,"Bitte wählen",false,false,false]
[false,"Bitte wählen",false,false,false]
[false,"Bitte wählen",false,false,false]
[false,"Bitte wählen",false,false,false]
[false,"Bitte wählen",false,false,false]

{"sheet":"ICONS","index":8,"n_rows":0,"n_cols":0,"rows_kept":0,"cut":false,"hidden":true,"merged":[]}