{"text_format":"1","workbook":"xlsx","n_sheets":13,"sheets":["Startseite","Hilfe","Eingaben","Überblick","Rabatte","Couponing","Skonti","Kalkulation_eigen","Kalkulation_Handelswaren","TabVorlage","Tabelle1","VERLAUF","ICONS"],"not_rendered":{"charts":1,"images":17,"macros":1,"external_links":0,"defined_names":37,"comments":0,"pivot_tables":0},"unopened":[],"bounds":{"document_bytes":16777216,"sheet_cells":100000,"rows_first":2000,"rows_last":500,"rows_between":2000,"halvings":0,"cell_chars":16384,"cell_head_chars":4096},"cells_cut":0,"cells_raw":0,"read":"whole","date_system":"1900"}

{"sheet":"Startseite","index":0,"n_rows":23,"n_cols":8,"rows_kept":23,"cut":false,"hidden":false,"merged":[[0,1,3,10],[22,7,22,10],[17,2,17,4],[11,9,11,10],[17,6,17,7],[14,2,14,4],[15,2,15,4],[16,2,16,4],[12,9,12,10],[13,2,13,4],[11,2,11,4],[12,2,12,4],[9,2,9,9],[20,2,20,4],[18,2,18,4],[18,6,18,7],[20,6,20,7],[19,6,19,7],[19,2,19,4],[16,6,16,7],[15,6,15,7],[11,6,11,7],[10,6,10,7],[13,6,13,7],[12,6,12,7],[14,6,14,7]]}
[null,"Rabattmodelle berechnen und vergleichen"]
[]
[]
[]
[]
[]
[null,null,{"$f":"B1","v":"Rabattmodelle berechnen und vergleichen"}]
[null,null,"Susanne Kowalski"]
[]
[null,null,"Preispolitische Maßnahmen, wie das Gewähren von Rabatten oder Skonti haben in der Regel direkte Auswirkungen auf die Umsatz- und Absatzsituation eines Unternehmens. Sie verändern den Preis und stellen ein Mittel der Preisvariation dar. Diese Anwendung unterstützt Sie bei der Wahl des richtigen Rabattsystems und der Bestimmung der optimalen Rabatthöhe. Damit Sie darüber hinaus Auswirkungen im Zusammenhang mit Zahlungsbedingen im Blick haben, werden auch Skonti berücksichtigt."]
[null,null,"» Hilfe",null,null,null,"» Couponing"]
[null,null,"» Eingaben",null,null,null,"» Skonti"]
[null,null,"» Überblick",null,null,null,"» Kalkulation Eigenerzeugnisse"]
[null,null,"» Rabatte",null,null,null,"» Kalkulation Handelswaren"]
[]
[]
[]
[]
[]
[]
[]
[]
[null,null,null,null,null,null,null,"Tabelle einfügen / Startseite konfigurieren"]

{"sheet":"Hilfe","index":1,"n_rows":90,"n_cols":14,"rows_kept":90,"cut":false,"hidden":false,"merged":[[0,2,2,14],[32,3,32,13],[24,3,24,13],[28,3,28,13],[30,3,30,13],[5,3,5,4],[6,3,6,4],[20,3,20,13],[11,3,11,13],[12,3,12,13],[13,3,13,13],[14,3,14,13],[15,3,15,13],[21,3,21,13],[72,3,72,13],[35,3,35,13],[37,4,37,13],[41,3,41,13],[63,11,63,14],[60,3,60,13],[64,3,64,13],[45,3,45,13],[68,3,68,13],[81,3,81,13],[85,3,85,13],[89,3,89,13],[74,3,74,13],[77,3,77,13]]}
[null,null,"Anwenderhilfe für Excel"]
[]
[]
[]
[]
[null,null,null,"» Inhaltliche Hilfe",null,null,null,null,null,null,null,null,null,"» Startseite"]
[null,null,null,"» Technische Hilfe"]
[]
[]
[null,null,null,"Inhaltliche Hilfe"]
[]
[null,null,null,"Die Musterlösung Rabattsysteme arbeitet im Wesentlichen mit folgenden Tabellenarbeitsblättern:\n\n• Eingaben\n• Überblick\n• Rabatte\n• Couponing\n• Skonti\n\nDie Arbeitsblätter Eingaben und Überblick zeigen die alternativen Preisgestaltungsvarianten in Tabellen- bzw. Diagrammform. In den Tabellen Rabatte, Couponing und Skonti werden die Grundlagen für die Alternativen gelegt. Das heißt, bevor Sie sinnvoll mit der Anwendung arbeiten können, müssen Sie zunächst die Grundlagendaten in diesen Tabellen erfassen."]
[null,null,null,"Die Tabelle Rabatte\n\nIn der Tabelle Rabatte werden Mengen-, Funktions-, Personen- und Treuerabatte unterschieden.\n\nIm Zusammenhang mit Mengenrabatten müssen Sie festlegen, welcher Menge Sie welchem Rabattsatz zuordnen wollen. Bei Bedarf können Sie in der zugehörigen Spalte Rabattvariante eine Bezeichnung für den Rabatt vorgeben. Zwingend erforderlich ist die Eingabe nicht. Die Mengenrabatte können Sie dabei wahlweise auf einen einzelnen Auftrag oder auf eine bestimmte Periode beziehen.\n\nDer Bereich Funktionsrabatte deckt unterschiedliche Rabattvarianten wie Pauschalfunktionsrabatt, Personenrabatt, Händlerrabatt etc. ab. Welche Variante genommen wird, hängt im Prinzip von der von Ihnen zu vergebenden Bezeichnung der Rabattvariante ab. Auch hier geben Sie den individuellen Rabattsatz vor.\n\nZeitrabatte, wie Einführungs-, Vorausbestellungs-, Saison- oder Auslaufrabatte werden auf den Zeitpunkt der Bestellung oder den Abnahmetermin der Ware bezogen. Einführungsrabatte sollen den Absatz neuer Produkte ankurbeln.  Mit Vorausbestellungs- und Saisonrabatten soll eine bessere Disposition und eine gleichmäßige Produktion erreicht werden. Auslaufrabatte dienen in der Regel der Räumung von Lägern. Auch in diesem Zusammenhang sind die Eingabe von Rabattvariante in Form einer Bezeichnung und dem zugehörigen Rabattsatz erforderlich. Dies gilt auch für Treuerabatte, die Kundentreue belohnen und der Konkurrenz Geschäftsbeziehungen erschweren sollen.\n\nHinweis: Felder, die Sie nicht benötigen, lassen Sie frei."]
[null,null,null,"Die Tabelle Couponing\n\nDas Couponing als Sonderform der Rabattgewährung erfreut sich immer größerer Beliebtheit. Für den Kauf von Waren erhält der Kunde Punkte. Die Punkte sammelt der Kunde. Das Erreichen verschiedener Punktzahlen wird dann vom Verkäufer in der Regel mit prozentualen Preisnachlässen honoriert. Um mit diesem preispolitischen Instrument arbeiten zu können, geben Sie in der Spalte Warenwert Werte vor und ordnen diesen in der nebenstehenden Spalte Punkte die gewünschte Punktzahl zu. Im Bereich Preisnachlass erfassen Sie Punktzahlen und den zugehörigen prozentualen Preisabschlag. Da erfahrungsgemäß nicht alle Kunden diese Form des Preisnachlasses nutzen bzw. nutzen können, tragen Sie im Feld Wahrscheinlichkeit ein, zu wie viel Prozent Sie mit dem Einlösen des Preisnachlasses rechnen."]
[null,null,null,"Die Tabelle Skonti\n\nSkonto soll einen Anreiz für den Kunden darstellen, den Rechnungsbetrag unverzüglich zu begleichen. Auf diese Weise wird der Rechnungsbetrag reduziert. In unserer Tabelle Skonti können Sie sowohl Skonto als auch das zugehörige Zahlungsziel individuell bestimmen. Der Text in der Spalte Definition wird automatisch vom Programm generiert."]
[null,null,null,"Rabatte und Skonti vergleichen\n\nNachdem Sie alle Grundlagendaten erfasst haben, arbeiten Sie mit der Tabelle Eingaben. Anschließend können Sie die unterschiedlichen Auswirkungen der Rabattsysteme für konkrete Praxissituationen ablesen. \n\n1 - Erfassen Sie zunächst Menge und Preis im oberen Tabellenteil. Für den Fall, dass Sie keine Mengen berücksichtigen wollen, geben Sie in das Feld Menge die Ziffer 1 und unter Preis den Gesamtrechnungsbetrag ein. \n2 - Im folgenden Tabellenbereich haben Sie die Möglichkeit, bis zu drei Skontovarianten auszuwählen. Benötigen Sie die drei Felder nicht, schalten Sie die Berechnung durch Auswahl des Eintrags Zahlung ohne Abzug ab.  \n3 - Möchten Sie Couponing berücksichtigen, haken Sie das zugehörige Kontrollkästchen ab. Die erreichte Punktzahl wird anhand des Warenwertes ermittelt und dem zugehörigen Abschlag zugeordnet. Dieser wiederum wird mit dem Warenwert multipliziert und ergibt den Preisnachlass.\n4 - Im Bereich Rabatte haken Sie das zugehörige Kontrollkästchen ab, wenn Sie einen Mengenrabatt berücksichtigen wollen. In den Zeilen Funktions-, Zeit- und Treuerabatt wählen Sie bei Bedarf aus dem Kombinationsfeld die gewünschte Variante aus. Entscheiden Sie sich für kein Rabatt, wenn der zugehörige Rabatt unberücksichtigt bleiben soll. Die zugehörigen Rabatte werden ebenfalls automatisch ausgewiesen.\n5 - Die grafische Auswertung und eine Zusammenfassung des Zahlenmaterials finden Sie im Arbeitsblatt Überblick."]
[]
[]
[null,null,null,"Technische Hilfe",null,null,null,null,null,null,null,null,null,"» Startseite"]
[]
[null,null,null,"Zum komfortablen Umgang mit diesem und anderen Excel-Tools erläutern wir hier einige Funktionen, die Sie beim Arbeiten mit Excel häufig benötigen, wie etwa die Anpassung der Startseite an Ihre persönlichen Bedürfnisse oder die Möglichkeiten der Haufe Toolbar. "]
[]
[]
[null,null,null,"Startseite konfigurieren"]
[null,null,null,"Über den Link Startseite konfigurieren gelangen Sie in ein Dialogfeld, in dem Sie alle nötigen Anpassungen der Startseite vornehmen können. \nHier können Sie weitere Tabellen einfügen, diese umbenennen oder löschen. Haben Sie eine Tabelle in der Liste markiert, können Sie mithilfe der Pfeiltasten die Reihenfolge der Tabellen ändern. Diese Änderung wirkt sich sowohl auf die Darstellung auf der Startseite aus, als auch auf die Position der Tabelle im Blattregister und im Listenfeld in der Toolbar."]
[]
[]
[]
[null,null,null,"Klicken Sie auf Speichern, werden die vorgenommenen Änderungen wirksam und Sie springen zurück zur Startseite."]
[]
[null,null,null,"Wenn Sie eine Tabelle im Listenfeld ausgewählt haben, gelangen Sie über den Button Gehe zu direkt zur gewünschten Tabelle."]
[]
[null,null,null,"Möchten Sie eine Tabelle umbenennen, markieren Sie diese und vergeben Sie im nebenstehenden Feld einen neuen Namen. \nMithilfe des Buttons Tabelle umbenennen werden die Änderungen gespeichert."]
[]
[null,null,null,"Logo auswählen"]
[null,null,null,"Über das Feld Logo auswählen können Sie Ihr eigenes Firmenlogo auf jeder Tabellenseite einbinden. Klicken Sie auf Durchsuchen, wählen Sie die gewünschte Datei aus und importieren Sie diese mithilfe des Buttons Hochladen.\nBitte beachten Sie dabei unbedingt die maximale Größe des neuen Logos. Die Datei sollte die Maße 35 px (Breite) und 84px (Höhe) nicht überschreiten. Bitte achten Sie auch darauf, dass die Datei 50 KB nicht überschreitet."]
[]
[null,null,null,"Hinweis:","Bitte ändern Sie die Namen der Blattregister nur über das Dialogfeld Tabelle einfügen/Startseite konfigurieren auf der Startseite. \nWenn Sie die Blattregister per Doppelklick umbenennen, funktionieren die Navigationslinks der Startseite bis zu einer Aktualisierung nicht mehr)."]
[]
[]
{"$rows_left_out":51}
{"sheet":"Eingaben","index":2,"n_rows":46,"n_cols":10,"rows_kept":46,"cut":false,"hidden":false,"merged":[[0,2,2,10]]}
[null,null,"Eingaben"]
[]
[]
[]
[]
[null,null,null,null,"Eingaben",null,null,null,null,"» Startseite"]
[]
[null,null,null,null,"Menge",null,"Preis",null,"Warenwert",{"$f":"E9*G9","v":6900}]
[null,null,null,null,100,null,69,null,"Zu berücksichtigender Wert",{"$f":"IF(J8<100,ROUNDDOWN(J8,-1),ROUNDDOWN(J8,-2))","v":6900}]
[]
[null,null,null,null,{"$f":"E9","v":100}]
[null,null,null,null,"Skonto",null,null,null,13,{"$f":"VLOOKUP($I$12,Skonti!$D$9:$E$28,2)*$J$8","v":224.25}]
[]
[null,null,null,null,null,null,null,null,7,{"$f":"VLOOKUP($I$14,Skonti!$D$9:$E$28,2)*$J$8","v":120.75000000000001}]
[]
[null,null,null,null,null,null,null,null,1,{"$f":"VLOOKUP($I$16,Skonti!$D$9:$E$28,2)*$J$8","v":0}]
[]
[]
[null,null,null,null,"Couponing",{"$f":"IF(E20=TRUE,IF(J8<Couponing!E11,0,VLOOKUP(J9,Couponing!E11:F35,2)),0)","v":13},"Punkte"]
[null,null,null,null,true,{"$f":"IF(F19<Couponing!H11,0,H20)","v":10},"zu bewertende Punkte",{"$f":"ROUNDDOWN(F19,-1)","v":10}]
[null,null,null,null,null,null,"Preisnachlass",{"$f":"IF(F20<Couponing!H11,0,VLOOKUP($F$20,Couponing!$H$11:$I$35,2))","v":5.0000000000000001E-3},"entspricht",{"$f":"J8*H21","v":34.5}]
[null,null,null,null,null,null,null,null,"Wahrscheinlichkeit",{"$f":"Couponing!F8*J21","v":17.25}]
[]
[]
[null,null,null,null,"Rabatte"]
[]
[null,null,null,null,"Mengenrabatt",true,null,"Rabattsatz",{"$f":"IF(F27=TRUE,IF(E11<Rabatte!E11,0,VLOOKUP(E11,Rabatte!E10:F35,2)),0)","v":0.02},{"$f":"I27*J8","v":138}]
[]
[null,null,null,null,"Funktionsrabatt",null,2,"Rabattsatz",{"$f":"VLOOKUP(G29,Rabatte!G10:I35,3)","v":0.05},{"$f":"I29*J8","v":345}]
[]
[null,null,null,null,"Zeitrabatt",null,3,"Rabattsatz",{"$f":"VLOOKUP(G31,Rabatte!J10:L35,3)","v":1.4999999999999999E-2},{"$f":"I31*J8","v":103.5}]
[]
[null,null,null,null,"Treuerabatt",null,2,"Rabattsatz",{"$f":"VLOOKUP(G33,Rabatte!M10:P35,4)","v":0.02},{"$f":"I33*J8","v":138}]
[]
[]
[]
[]
[]
[null,null,null,null,"Skonto 1",{"$f":"J12","v":224.25}]
[null,null,null,null,"Skonto 2",{"$f":"J14","v":120.75000000000001}]
{"$rows_left_out":7}
{"sheet":"Überblick","index":3,"n_rows":15,"n_cols":15,"rows_kept":15,"cut":false,"hidden":false,"merged":[[0,2,2,15]]}
[null,null,"Überblick"]
[]
[]
[]
[]
[null,null,null,"Überblick über alle Alternativen",null,null,null,null,null,null,null,null,null,null,"» Startseite"]
[]
[null,null,null,{"$f":"Eingaben!E39","v":"Skonto 1"},{"$f":"Eingaben!F39","v":224.25}]
[null,null,null,{"$f":"Eingaben!E40","v":"Skonto 2"},{"$f":"Eingaben!F40","v":120.75000000000001}]
[null,null,null,{"$f":"Eingaben!E41","v":"Skonto 3"},{"$f":"Eingaben!F41","v":0}]
[null,null,null,{"$f":"Eingaben!E42","v":"Couponing"},{"$f":"Eingaben!F42","v":17.25}]
[null,null,null,{"$f":"Eingaben!E43","v":"Mengenrabatt"},{"$f":"Eingaben!F43","v":138}]
[null,null,null,{"$f":"Eingaben!E44","v":"Raumrabatt"},{"$f":"Eingaben!F44","v":345}]
[null,null,null,{"$f":"Eingaben!E45","v":"Personalrabatt"},{"$f":"Eingaben!F45","v":103.5}]
[null,null,null,{"$f":"Eingaben!E46","v":"Treuerabatt"},{"$f":"Eingaben!F46","v":138}]

{"sheet":"Rabatte","index":4,"n_rows":35,"n_cols":16,"rows_kept":35,"cut":false,"hidden":false,"merged":[[0,2,2,16],[7,3,7,5],[7,7,7,8],[7,10,7,11],[7,13,7,15]]}
[null,null,"Rabatte"]
[]
[]
[]
[]
[null,null,null,"Rabatte",null,null,null,null,null,null,null,null,null,null,null,"» Startseite"]
[]
[null,null,null,"Mengenrabatte",null,null,null,"Funktionsrabatte",null,null,"Zeitrabatte",null,null,"Treuerabatte"]
[null,null,null,"Rabattvariante","Menge","Rabattsatz",null,"Rabattvariante","Rabattsatz",null,"Rabattvariante","Rabattsatz",null,"Rabattvariante","Jahre","Rabattsatz"]
[null,null,null,"kein Rabatt",0,0,1,"kein Rabatt",0,1,"kein Rabatt",0,1,"kein Rabatt",0,0]
[null,null,null,"RMV1",100,0.02,2,"RFV1",0.05,2,"RRV1",0.01,2,"RRV1",2,0.02]
[null,null,null,"RMV2",200,2.5000000000000001E-2,3,"RFV2",7.4999999999999997E-2,3,"RRV2",1.4999999999999999E-2,3,"RRV2",3,0.03]
[null,null,null,"RMV3",300,0.03,4,"RFV3",0.1,4,"RRV3",0.02,4,"RRV3",4,0.04]
[null,null,null,"RMV4",400,3.5000000000000003E-2,5,"RFV4",0.125,5,"RRV4",2.5000000000000001E-2,5,"RRV4",5,0.05]
[null,null,null,"RMV5",500,0.04,6,"RFV5",0.15,6,"RRV5",0.03,6,"RRV5",6,0.06]
[null,null,null,"RMV6",600,4.4999999999999998E-2,7,"RFV6",0.17499999999999999,7,"RRV6",3.5000000000000003E-2,7,"RRV6",7,7.0000000000000007E-2]
[null,null,null,"RMV7",700,0.05,8,"RFV7",0.2,8,"RRV7",0.04,8,"RRV7",8,0.08]
[null,null,null,"RMV8",800,5.5E-2,9,"RFV8",0.22500000000000001,9,"RRV8",4.4999999999999998E-2,9,"RRV8",9,0.09]
[null,null,null,"RMV9",900,0.06,10,"RFV9",0.25,10,"RRV9",0.05,10,"RRV9",10,0.1]
[null,null,null,"RMV10",1000,6.5000000000000002E-2,11,"RFV10",0.3,11,"RRV10",5.5E-2,11,"RRV10",11,0.11]
[null,null,null,"RMV11",1100,7.0000000000000007E-2,12,"RFV11",0.32500000000000001,12,"RRV11",0.06,12,"RRV11",12,0.12]
[null,null,null,"RMV12",1200,7.4999999999999997E-2,13,"RFV12",0.35,13,"RRV12",6.5000000000000002E-2,13,"RRV12",13,0.13]
[null,null,null,"RMV13",1300,0.08,14,"RFV13",0.375,14,"RRV13",7.0000000000000007E-2,14,"RRV13",14,0.14000000000000001]
[null,null,null,"RMV14",1400,8.5000000000000006E-2,15,"RFV14",0.4,15,"RRV14",7.4999999999999997E-2,15,"RRV14",15,0.15]
[null,null,null,"RMV15",1500,0.09,16,"RFV15",0.42499999999999999,16,"RRV15",0.08,16,"RRV15",16,0.16]
[null,null,null,"RMV16",1600,9.5000000000000001E-2,17,"RFV16",0.45,17,"RRV16",8.5000000000000006E-2,17,"RRV16",17,0.17]
[null,null,null,"RMV17",1700,0.1,18,"RFV17",0.47499999999999998,18,"RRV17",0.09,18,"RRV17",18,0.18]
[null,null,null,"RMV18",1800,0.105,19,"RFV18",0.5,19,"RRV18",9.5000000000000001E-2,19,"RRV18",19,0.19]
[null,null,null,"RMV19",1900,0.11,20,"RFV19",0.52500000000000002,20,"RRV19",0.1,20,"RRV19",20,0.2]
[null,null,null,"RMV20",2000,0.115,21,"RFV20",0.55000000000000004,21,"RRV20",0.105,21,"RRV20",21,0.21]
[null,null,null,"RMV21",2100,0.12,22,"RFV21",0.57499999999999996,22,"RRV21",0.11,22,"RRV21",22,0.22]
[null,null,null,"RMV22",2200,0.125,23,"RFV22",0.6,23,"RRV22",0.115,23,"RRV22",23,0.23]
[null,null,null,"RMV23",2300,0.13,24,"RFV23",0.625,24,"RRV23",0.12,24,"RRV23",24,0.24]
[null,null,null,"RMV24",2400,0.13500000000000001,25,"RFV24",0.65,25,"RRV24",0.125,25,"RRV24",25,0.25]
[null,null,null,"RMV25",2500,0.14000000000000001,26,"RFV25",0.67500000000000004,26,"RRV25",0.15,26,"RRV25",30,0.26]

{"sheet":"Couponing","index":5,"n_rows":35,"n_cols":9,"rows_kept":35,"cut":false,"hidden":false,"merged":[[7,7,7,8],[0,2,2,9]]}
[null,null,"Couponing"]
[]
[]
[]
[]
[null,null,null,"Couponing",null,null,null,null,"» Startseite"]
[]
[null,null,null,"Wahrscheinlichkeit des Einlösens",null,0.5,null,"Preisnachlass"]
[]
[null,null,null,null,"Warenwert","Punkte",null,"Punkte","Abschlag"]
[null,null,null,"CV1",500,1,null,10,5.0000000000000001E-3]
[null,null,null,"CV2",1000,2,null,20,0.01]
[null,null,null,"CV3",1500,3,null,30,1.4999999999999999E-2]
[null,null,null,"CV4",2000,4,null,40,0.02]
[null,null,null,"CV5",2500,5,null,50,2.5000000000000001E-2]
[null,null,null,"CV6",3000,6,null,60,0.03]
[null,null,null,"CV7",3500,7,null,70,3.5000000000000003E-2]
[null,null,null,"CV8",4000,8,null,80,0.04]
[null,null,null,"CV9",4500,9,null,90,4.4999999999999998E-2]
[null,null,null,"CV10",5000,10,null,100,0.05]
[null,null,null,"CV11",5500,11,null,110,5.5E-2]
[null,null,null,"CV12",6000,12,null,120,0.06]
[null,null,null,"CV13",6500,13,null,130,6.5000000000000002E-2]
[null,null,null,"CV14",7000,14,null,140,7.0000000000000007E-2]
[null,null,null,"CV15",7500,15,null,150,7.4999999999999997E-2]
[null,null,null,"CV16",8000,16,null,160,0.08]
[null,null,null,"CV17",8500,17,null,170,8.5000000000000006E-2]
[null,null,null,"CV18",9000,18,null,180,0.09]
[null,null,null,"CV19",9500,19,null,190,9.5000000000000001E-2]
[null,null,null,"CV20",10000,20,null,200,0.1]
[null,null,null,"CV21",10500,21,null,210,0.105]
[null,null,null,"CV22",11000,22,null,220,0.11]
[null,null,null,"CV23",11500,23,null,230,0.115]
[null,null,null,"CV24",12000,24,null,240,0.12]
[null,null,null,"CV25",12500,25,null,250,0.125]

{"sheet":"Skonti","index":6,"n_rows":28,"n_cols":9,"rows_kept":28,"cut":false,"hidden":false,"merged":[[7,5,7,6],[0,2,2,9]]}
[null,null,"Skonti"]
[]
[]
[]
[]
[null,null,null,"Skonto",null,null,null,"» Startseite"]
[]
[null,null,null,"Skontovariante","Skonto","Zahlungsziel",null,"Definition"]
[null,null,null,1,0,60,"Tage","zahlbar ohne Abzug"]
[null,null,null,2,5.0000000000000001E-3,50,"Tage",{"$f":"\"bei Zahlung innerhalb von \"&F10&\" Tagen gewähren wir \"&I10&\" % Skonto\"","v":"bei Zahlung innerhalb von 50 Tagen gewähren wir 0,5 % Skonto"},{"$f":"E10*100","v":0.5}]
[null,null,null,3,7.4999999999999997E-3,45,"Tage","bei Zahlung innerhalb von 45 Tagen gewähren wir 0,75 % Skonto",0.75]
[null,null,null,4,0.01,40,"Tage","bei Zahlung innerhalb von 40 Tagen gewähren wir 1 % Skonto",1]
[null,null,null,5,1.2500000000000001E-2,35,"Tage","bei Zahlung innerhalb von 35 Tagen gewähren wir 1,25 % Skonto",1.25]
[null,null,null,6,1.4999999999999999E-2,30,"Tage","bei Zahlung innerhalb von 30 Tagen gewähren wir 1,5 % Skonto",1.5]
[null,null,null,7,1.7500000000000002E-2,28,"Tage","bei Zahlung innerhalb von 28 Tagen gewähren wir 1,75 % Skonto",1.7500000000000002]
[null,null,null,8,0.02,24,"Tage","bei Zahlung innerhalb von 24 Tagen gewähren wir 2 % Skonto",2]
[null,null,null,9,2.2499999999999999E-2,21,"Tage","bei Zahlung innerhalb von 21 Tagen gewähren wir 2,25 % Skonto",2.25]
[null,null,null,10,2.5000000000000001E-2,18,"Tage","bei Zahlung innerhalb von 18 Tagen gewähren wir 2,5 % Skonto",2.5]
[null,null,null,11,2.75E-2,14,"Tage","bei Zahlung innerhalb von 14 Tagen gewähren wir 2,75 % Skonto",2.75]
[null,null,null,12,0.03,12,"Tage","bei Zahlung innerhalb von 12 Tagen gewähren wir 3 % Skonto",3]
[null,null,null,13,3.2500000000000001E-2,10,"Tage","bei Zahlung innerhalb von 10 Tagen gewähren wir 3,25 % Skonto",3.25]
[null,null,null,14,3.5000000000000003E-2,8,"Tage","bei Zahlung innerhalb von 8 Tagen gewähren wir 3,5 % Skonto",3.5000000000000004]
[null,null,null,15,3.7499999999999999E-2,7,"Tage","bei Zahlung innerhalb von 7 Tagen gewähren wir 3,75 % Skonto",3.75]
[null,null,null,16,0.04,5,"Tage","bei Zahlung innerhalb von 5 Tagen gewähren wir 4 % Skonto",4]
[null,null,null,17,4.2500000000000003E-2,4,"Tage","bei Zahlung innerhalb von 4 Tagen gewähren wir 4,25 % Skonto",4.25]
[null,null,null,18,4.4999999999999998E-2,3,"Tage","bei Zahlung innerhalb von 3 Tagen gewähren wir 4,5 % Skonto",4.5]
[null,null,null,19,4.7500000000000001E-2,2,"Tage","bei Zahlung innerhalb von 2 Tagen gewähren wir 4,75 % Skonto",4.75]
[null,null,null,20,0.05,0,"Tage","bei Zahlung innerhalb von 0 Tagen gewähren wir 5 % Skonto",5]

{"sheet":"Kalkulation_eigen","index":7,"n_rows":29,"n_cols":7,"rows_kept":29,"cut":false,"hidden":false,"merged":[[0,2,2,7]]}
[null,null,"Kalkulation"]
[]
[]
[]
[]
[null,null,null,"Kalkulation selbst hergestellter Erzeugnisse"]
[]
[null,null,null,null,"Zuschlagssatz","Betrag","Anteil"]
[null,null,null,"Fertigungsmaterial",null,50,{"$f":"IF($F$29=0,\"\",F9/$F$29)","v":0.15419772210171498}]
[null,null,null,"Materialgemeinkosten",0.25,{"$f":"F9*E10","v":12.5},{"$f":"IF($F$29=0,\"\",F10/$F$29)","v":3.8549430525428745E-2}]
[null,null,null,"Materialkosten",null,{"$f":"F10+F9","v":62.5},0.19274715262714373]
[null,null,null,"Fertigungslöhne",null,40,0.12335817768137199]
[null,null,null,"Fertigungsgemeinkosten",0.3,{"$f":"F12*E13","v":12},3.7007453304411596E-2]
[null,null,null,"Sondereinzelkosten der Fertigung",null,10,3.0839544420342997E-2]
[null,null,null,"Fertigungskosten",null,{"$f":"SUM(F12:F14)","v":62},0.19120517540612658]
[null,null,null,"Herstellkosten",null,{"$f":"+F15+F11","v":124.5},0.38395232803327028]
[null,null,null,"Verwaltungsgemeinkosten",0.35,{"$f":"E17*$F$16","v":43.574999999999996},0.13438331481164459]
[null,null,null,"Vertriebsgemeinkosten",0.05,{"$f":"E18*$F$16","v":6.2250000000000005},1.9197616401663516E-2]
[null,null,null,"Sondereinzelkosten des Vertriebs",null,10,3.0839544420342997E-2]
[null,null,null,"Selbstkosten",null,{"$f":"SUM(F16:F19)","v":184.29999999999998},0.56837280366692133]
[null,null,null,"Gewinn",0.1,{"$f":"E21*F20","v":18.43},5.6837280366692139E-2]
[null,null,null,"Barverkaufspreis",null,{"$f":"F21+F20","v":202.73},0.62521008403361356]
[null,null,null,"Kundenskonto",0.02,{"$f":"E23*$F$22/(100%-E23-E24)","v":4.3597849462365588},1.3445378151260505E-2]
[null,null,null,"Vertreterprovision",0.05,{"$f":"E24*$F$22/(100%-E24-E23)","v":10.899462365591399},3.3613445378151273E-2]
[null,null,null,"Zielverkaufspreis",null,{"$f":"SUM(F22:F24)","v":217.98924731182794},0.67226890756302526]
[null,null,null,"Kundenrabatt",0.2,{"$f":"E26*F25/(100%-E26)","v":54.497311827956985},0.16806722689075632]
[null,null,null,"Listenverkaufspreis",null,{"$f":"+F26+F25","v":272.4865591397849},0.84033613445378152]
[null,null,null,"MwSt",0.19,{"$f":"E28*F27","v":51.772446236559134},0.1596638655462185]
[null,null,null,"Bruttoverkaufspreis",null,{"$f":"+F27+F28","v":324.25900537634402},1]

{"sheet":"Kalkulation_Handelswaren","index":8,"n_rows":29,"n_cols":7,"rows_kept":29,"cut":false,"hidden":false,"merged":[[0,2,2,7]]}
[null,null,"Kalkulation"]
[]
[]
[]
[]
[null,null,null,"Kalkulation von Handelswaren"]
[]
[null,null,null,"Bezeichnung","Zuschlags-","Kosten"," Anteil"]
[null,null,null,null,"satz",null,"am BVP"]
[null,null,null,"Bruttolistenpreis",null,119,{"$f":"F10/$F$22","v":0.98347107438016534}]
[null,null,null,"Mehrwertsteuersatz",0.19,{"$f":"F10/(100%+E11)*E11","v":19},{"$f":"F11/$F$22","v":0.15702479338842976}]
[null,null,null,"Listenpreis ohne Mehrwertsteuer",null,{"$f":"+F10-F11","v":100},0.82644628099173556]
[null,null,null,"Liefererrabatt",0.1,{"$f":"F12*E13","v":10},8.2644628099173556E-2]
[null,null,null,"Zieleinkaufspreis",null,{"$f":"+F12-F13","v":90},0.74380165289256195]
[null,null,null,"Lieferantenskonto",0.01,{"$f":"F14*E15","v":0.9},7.4380165289256199E-3]
[null,null,null,"Bareinkaufspreis",null,{"$f":"+F14-F15","v":89.1},0.73636363636363633]
[null,null,null,"Bezugskosten",null,10.9,9.0082644628099173E-2]
[null,null,null,"Bezugspreis",null,{"$f":"+F16+F17","v":100},0.82644628099173556]
[null,null,null,"Geschäftskosten",0.1,{"$f":"F18*E19","v":10},8.2644628099173556E-2]
[null,null,null,"Selbstkosten",null,{"$f":"+F18+F19","v":110},0.90909090909090906]
[null,null,null,"Gewinn",0.1,{"$f":"F20*E21","v":11},9.0909090909090912E-2]
[null,null,null,"Barverkaufspreis (BVP)",null,{"$f":"+F20+F21","v":121},1]
[null,null,null,"Skonto",0.01,{"$f":"E23*F22/(100%-E23-E24)","v":1.3595505617977528},1.1235955056179775E-2]
[null,null,null,"Vertreterprovision",0.1,{"$f":"E24*F22/(100%-E24-E23)","v":13.59550561797753},0.11235955056179776]
[null,null,null,"Zielverkaufspreis (ZVP)",null,{"$f":"+F22+F23+F24","v":135.95505617977528},1.1235955056179776]
[null,null,null,"Kundenrabatt",0.1,{"$f":"E26*F25/(100%-E26)","v":15.106117353308367},0.12484394506866418]
[null,null,null,"Listenverkaufspreis, netto",null,{"$f":"F25+F26","v":151.06117353308366},1.2484394506866419]
[null,null,null,"Mehrwertsteuersatz",0.19,{"$f":"F27*E28","v":28.701622971285897},0.23720349563046195]
[null,null,null,"Listenverkaufspreis, brutto",null,{"$f":"+F27+F28","v":179.76279650436956},{"$f":"F29/$F$22","v":1.4856429463171039}]

{"sheet":"TabVorlage","index":9,"n_rows":6,"n_cols":8,"rows_kept":6,"cut":false,"hidden":true,"merged":[[0,2,2,8]]}
[null,null,{"$f":"Startseite!B1","v":"Rabattmodelle berechnen und vergleichen"}]
[]
[]
[]
[]
[null,null,null,"Untertitel",null,null,null,"» Startmenü"]

{"sheet":"Tabelle1","index":10,"n_rows":6,"n_cols":5,"rows_kept":6,"cut":false,"hidden":true,"merged":[]}
[false,"Bitte wählen",false,false,false]
[false,"Bitte wählen",false,false,false]
[false,"Bitte wählen",false,false,false]
[false,"Bitte wählen",false,false,false]
[false,"Bitte wählen",false,false,false]
[false,"Bitte wählen",false,false,false]

{"sheet":"VERLAUF","index":11,"n_rows":1,"n_cols":2,"rows_kept":1,"cut":false,"hidden":true,"merged":[]}
["Startseite",6]

{"sheet":"ICONS","index":12,"n_rows":0,"n_cols":0,"rows_kept":0,"cut":false,"hidden":true,"merged":[]}